{"text_format":"1","workbook":"xlsx","n_sheets":15,"sheets":["CAPA","PagIn","BASE","Id","ConsAnual","DadosAnual","DefInd","AnACeS","AnACeS_base","AnIndT","AnIndA","AnInd_baseT","AnInd_baseA","AnR","AnR_base"],"not_rendered":{"charts":19,"images":10,"macros":1,"external_links":1,"defined_names":161,"comments":0,"pivot_tables":0},"unopened":[],"bounds":{"document_bytes":16777216,"sheet_cells":100000,"rows_first":2000,"rows_last":500,"rows_between":2000,"halvings":0,"cell_chars":16384,"cell_head_chars":4096},"cells_cut":0,"cells_raw":0,"read":"whole","date_system":"1900"}

{"sheet":"CAPA","index":0,"n_rows":24,"n_cols":3,"rows_kept":24,"cut":false,"hidden":false,"merged":[[1,1,1,3],[23,2,23,3]]}
[]
[null,"mort@lidades.infantil"]
[]
[]
[]
[]
[]
[]
[]
[]
[]
[]
[]
[]
[]
[]
[]
[]
[]
[]
[]
[]
[]
[null,null,"Última atualização: 01/06/2012"]

{"sheet":"PagIn","index":1,"n_rows":17,"n_cols":4,"rows_kept":17,"cut":false,"hidden":false,"merged":[[1,1,1,3],[3,1,3,3],[13,1,15,1],[20,1,20,3]]}
[]
[null,"mort@lidades.infantil"]
[]
[null,"Página Inicial"]
[]
[]
[null,"Consulta de Indicadores (Anual)",null,"Análise por Indicador"]
[]
[null,null,null,"  Selecione o Indicador"]
[]
[null,"Permite consultar o valor anual (1996-2011)  por indicador ou por local de residência.",null,"Permite observar a evolução de um determinado indicador para o Continente, para a região e, caso pretenda, para um determinado ACeS. Para um determinado triénio (ou ano) podem observar-se, também, os valores do respetivo indicador ordenados por ACeS através de um gráfico de barras e o seu mapeamento."]
[]
[null,"Análise por ACeS",null,"Análise da Razão R por Indicador"]
[]
[null,null,null,"  Selecione o Indicador"]
[]
[null,"Permite visualizar a evolução de vários indicadores num determinado ACeS, comparativamente com o Continente e a região, numa única página.",null,"Permite evidenciar variações geográficas com recurso à razão entre o número de acontecimentos observados e o número de acontecimentos esperados nos ACeS, caso fossem observadas as distribuições do indicador para o Continente ou para a região."]

{"sheet":"BASE","index":2,"n_rows":190,"n_cols":41,"rows_kept":190,"cut":false,"hidden":true,"merged":[]}
["Icod","Indicador","cod_Res","Rcod","Local_Residencia","Local_Residencia2","cod_IndRes","A96","A97","A98","A99","A00","A01","A02","A03","A04","A05","A06","A07","A08","A09","A10","A11","T01","T02","T03","T04","T05","T06","T07","T08","T09","T10","T11","T12","T13","T14","Q01","Q02","Q03","Q04"]
["I27","População Média","CT","R01","CONTINENTE","Continente","I27R01",9572961,9608690,9648988.5,9693475,9748596,9815633,9889430,9959546.5,10017708.5,10062958.5,10096212.5,10118575.5,10131094.5,10140124.5,10144270,10047083,28830639.5,28951153.5,29091059.5,29257704,29453659,29664609.5,29866685,30040213.5,30176879.5,30277746.5,30345882.5,30389794.5,30415489,30331477.5,48272710.5,49745276.5,50630277,50581147.5]
["I27","População Média","RA","R02","REGIÃO ALENTEJO","Região Alentejo","I27R02",528004,526881.5,525986,525116,524684,524333.5,523929,522980.5,521478,519499.5,516866.5,513621.5,509580,505494,501272.5,509741,1580871.5,1577983.5,1575786,1574133.5,1572946.5,1571243,1568387.5,1563958,1557844,1549987.5,1540068,1528695.5,1516346.5,1516507.5,2630671.5,2612220.5,2546834.5,2539709]
["I27","População Média","A401","R03","ALENTEJO LITORAL","ACES Alentejo Litoral","I27R03",96469,96682.5,96918.5,97197,97564.5,97850,97967,97898.5,97711,97405.5,96983,96478,95846.5,95214,94576.5,97895,290070,290798,291680,292611.5,293381.5,293715.5,293576.5,293015,292099.5,290866.5,289307.5,287538.5,285637,287685.5,484831.5,488832,479098,480010]
["I27","População Média","A402","R04","ALENTEJO CENTRAL I","ACES Alentejo Central I","I27R04",59598,59277.5,58986.5,58711,58506,58293.5,58092.5,57877.5,57613.5,57271,56867,56443.5,55935,55391,54826.5,55165,177862,176975,176203.5,175510.5,174892,174263.5,173583.5,172762,171751.5,170581.5,169245.5,167769.5,166152.5,165382.5,295079,289148,279463,277761]
["I27","População Média","A403","R05","ALENTEJO CENTRAL II","ACES Alentejo Central II","I27R05",109427,109838,110288.5,110742.5,111284.5,111865.5,112512.5,113060.5,113442,113699,113805.5,113718,113405.5,113072.5,112692.5,111541,329553.5,330869,332315.5,333892.5,335662.5,337438.5,339015,340201.5,340946.5,341222.5,340929,340196,339170.5,337306,551580.5,564579.5,566694,564429.5]
["I27","População Média","A904","R06","ALTO ALENTEJO","ULS Norte Alentejano","I27R06",127265,126574,125929,125315,124781.5,124207.5,123591,122848,122019.5,121117,120062,118842,117485.5,116166.5,114791.5,118448,379768,377818,376025.5,374304,372580,370646.5,368458.5,365984.5,363198.5,360021,356389.5,352494,348443.5,349406,629864.5,613783,587347.5,585733.5]
["I27","População Média","A905","R07","BAIXO ALENTEJO","ULS Baixo Alentejo","I27R07",135245,134509.5,133863.5,133150.5,132547.5,132117,131766,131296,130692,130007,129149,128140,126907.5,125650,124385.5,126692,403618,401523.5,399561.5,397815,396430.5,395179,393754,391995,389848,387296,384196.5,380697.5,376943,376727.5,669316,655878,634232,631775]
["I01","Nados Vivos","CT","R01","CONTINENTE","Continente","I01R01",103668,106299,106857,109381,113318,106479,108192,106232,103309,103420,99713,96925,99057,94324,96133,91700,316824,322537,329556,329178,327989,320903,317733,312961,306442,300058,295695,290306,289514,282157,539523,527632,486152,478139]
["I01","Nados Vivos","RA","R02","REGIÃO ALENTEJO","Região Alentejo","I01R02",4393,4673,4653,4688,4778,4423,4543,4597,4582,4480,4102,3999,4188,4038,4145,4090,13719,14014,14119,13889,13744,13563,13722,13659,13164,12581,12289,12225,12371,12273,23185,22625,20472,20460]
["I01","Nados Vivos","A401","R03","ALENTEJO LITORAL","ACES Alentejo Litoral","I01R03",743,780,778,830,803,785,795,833,862,821,748,750,815,789,824,833,2301,2388,2411,2418,2383,2413,2490,2516,2431,2319,2313,2354,2428,2446,3934,4096,3926,4011]
["I01","Nados Vivos","A402","R04","ALENTEJO CENTRAL I","ACES Alentejo Central I","I01R04",493,507,472,479,480,451,460,479,455,385,406,385,401,367,377,407,1472,1458,1431,1410,1391,1390,1394,1319,1246,1176,1192,1153,1145,1151,2431,2230,1936,1937]
["I01","Nados Vivos","A403","R05","ALENTEJO CENTRAL II","ACES Alentejo Central II","I01R05",993,1098,1073,1089,1112,1031,1072,1092,1104,1077,1056,971,1011,940,943,957,3164,3260,3274,3232,3215,3195,3268,3273,3237,3104,3038,2922,2894,2840,5365,5376,4921,4822]
["I01","Nados Vivos","A904","R06","ALTO ALENTEJO","ULS Norte Alentejano","I01R06",1056,1108,1075,1154,1147,1035,1052,1015,979,999,851,802,896,879,914,877,3239,3337,3376,3336,3234,3102,3046,2993,2829,2652,2549,2577,2689,2670,5540,5080,4342,4368]
["I01","Nados Vivos","A905","R07","BAIXO ALENTEJO","ULS Baixo Alentejo","I01R07",1108,1180,1255,1136,1236,1121,1164,1178,1182,1198,1041,1091,1065,1063,1087,1016,3543,3571,3627,3493,3521,3463,3524,3558,3421,3330,3197,3219,3215,3166,5915,5843,5347,5322]
["I02","Taxa Bruta de Natalidade","CT","R01","CONTINENTE","Continente","I02R01",10.829251263010473,11.062798362732069,11.074425055020015,11.283982266421486,11.624032835087226,10.847899468123961,10.9401654089265,10.666349115393958,10.312637865236345,10.277295687943065,9.8762778616238514,9.5789175067182128,9.7775220633861419,9.3020554136194296,9.4765813607090514,9.1270272177506637,10.989142297728081,11.140730541185517,11.328428928482307,11.250985381491315,11.135764150729116,10.817705185028645,10.638375166175958,10.418068433501647,10.154860445394959,9.910182714555722,9.7441555703644482,9.5527463997823343,9.5186370339138708,9.302448256930445,11.176563205416029,10.606675389571912,9.6020015849409628,9.452909307761356]
["I02","Taxa Bruta de Natalidade","RA","R02","REGIÃO ALENTEJO","Região Alentejo","I02R02",8.3200127271763087,8.8691669758759808,8.8462430558988263,8.9275512458199717,9.1064335866921802,8.4354709359596516,8.6710222186593988,8.790002686524641,8.7865643421198971,8.6236849121125232,7.9362852883674995,7.7858890252841837,8.2185329094548454,7.9882253795297267,8.2689555082315511,8.0236826152889407,8.6781246926141673,8.880954712137358,8.9599729912564285,8.8232668957239007,8.7377415570078192,8.6320193630138693,8.7491133409313715,8.7336104933764211,8.4501400653723984,8.1168396519326773,7.9795177875262651,7.9970144479394358,8.1584255313676657,8.0929372258297434,8.8133391037231377,8.6612137068827071,8.0382137119628307,8.0560410661221429]
["I02","Taxa Bruta de Natalidade","A401","R03","ALENTEJO LITORAL","ACES Alentejo Litoral","I02R03",7.7019560687889372,8.0676440927779076,8.0273631969128711,8.5393582106443624,8.2304526748971192,8.0224833929483914,8.1149774924209179,8.5088126988666826,8.8219340708825005,8.4286821586050067,7.7126919150779001,7.77379298907523,8.5031795631556708,8.286596508916757,8.7125237241809543,8.5091169109760454,7.932568000827386,8.2118859139333829,8.2659078442128369,8.2635166423739328,8.122529880036744,8.2154329614882435,8.4816053056017768,8.5865911301469211,8.3225065431471119,7.9727297574660545,7.9949534664673392,8.1867297770559428,8.5002993309690282,8.5023402291738712,8.1141592491411973,8.3791568473422373,8.194565621229895,8.3560759150851016]
["I02","Taxa Bruta de Natalidade","A402","R04","ALENTEJO CENTRAL I","ACES Alentejo Central I","I02R04",8.2720896674385056,8.5529922820631779,8.001830927415595,8.1586074159867827,8.2042867398215567,7.736711640234331,7.9184059904462716,8.2761003844326382,7.8974545896361086,6.7224249620226644,7.139465771009549,6.8209802723077058,7.1690354876195581,6.625625101550793,6.8762368562647618,7.3778664007976076,8.2760792074754583,8.2384517587229826,8.1212915747984589,8.0337073850282472,7.9534798618576037,7.9764265035420499,8.0307172052643256,7.6347807967029784,7.2546673537057895,6.8940653001644367,7.0430233004718001,6.8725245053481121,6.8912595356675341,6.9596239021661903,8.2384717312990752,7.712313417350285,6.9275718073591142,6.9736212067208863]
["I02","Taxa Bruta de Natalidade","A403","R05","ALENTEJO CENTRAL II","ACES Alentejo Central II","I02R05",9.0745428459155413,9.9965403594384465,9.729028865203535,9.833623044449963,9.9924068491119602,9.2164250819063973,9.5278302410843239,9.6585456459152415,9.7318453482837057,9.4723788247917753,9.2789891525453516,8.5386658224731349,8.9149115342730294,8.3132503482279052,8.3679038090378697,8.579804735478433,9.6008690546451501,9.852842061359631,9.8520833364679046,9.6797621989113267,9.5780732134212201,9.4683920181010777,9.639691459079982,9.6207688678621341,9.4941581743763326,9.0967037636732631,8.9109462674046505,8.5891662453409214,8.5325816956368552,8.4196545569897943,9.7265947581540697,9.5221310727718596,8.6836987862938368,8.5431395772191205]
["I02","Taxa Bruta de Natalidade","A904","R06","ALTO ALENTEJO","ULS Norte Alentejano","I02R06",8.2976466428318858,8.753772496721286,8.536556313478231,9.2087938395243985,9.1920677343997301,8.3328301431072997,8.5119466627828881,8.2622427715550923,8.0233077499907797,8.2482227928366783,7.088004530992321,6.7484559330876293,7.6264730541215728,7.5667253468082452,7.9622620141735228,7.4040929352965019,8.5288913231235899,8.8322949144826346,8.9781145161697804,8.9125416773531683,8.6800150303290557,8.3691603724842931,8.2668740170195569,8.177941962022981,7.7891290850595478,7.366236969510112,7.1522870342700893,7.3107627363870025,7.7171765293368937,7.6415402139631263,8.7955425333543946,8.2765407318221591,7.3925572169797267,7.4573163392566757]
["I02","Taxa Bruta de Natalidade","A905","R07","BAIXO ALENTEJO","ULS Baixo Alentejo","I02R07",8.1925394654146189,8.772614573691822,9.3752217744194635,8.5316990923804266,9.3249589769705192,8.4849035324750037,8.8338418104822178,8.9720935900560566,9.0441649068037826,9.2148884290845885,8.0604573012566885,8.5141251755891982,8.3919390106967668,8.4600079586152006,8.7389607309533659,8.0194487418305815,8.7781020668057419,8.893626400447296,9.0774511558295785,8.7804632806706646,8.8817585932464826,8.7631174733475223,8.949750351742459,9.0766463857957369,8.7752149555724284,8.5980748574733532,8.3212626871926219,8.4555322795657979,8.5291410107098411,8.4039524590055148,8.8373802508829904,8.9086689902695309,8.4306689034927267,8.4238850856713228]
["I03","NV <20 anos","CT","R01","CONTINENTE","Continente","I03R01",7165,6970,6777,6701,6813,6236,6101,5551,5264,4983,4438,4369,4132,3927,3726,3331,20912,20448,20291,19750,19150,17888,16916,15798,14685,13790,12939,12428,11785,10984,34426,28135,20592,19485]
["I03","NV <20 anos","RA","R02","REGIÃO ALENTEJO","Região Alentejo","I03R02",497,496,426,429,419,380,388,362,329,296,257,255,223,212,226,220,1419,1351,1274,1228,1187,1130,1079,987,882,808,735,690,661,658,2267,1755,1173,1136]
["I03","NV <20 anos","A401","R03","ALENTEJO LITORAL","ACES Alentejo Litoral","I03R03",96,75,82,68,62,56,69,59,62,50,34,37,32,35,42,37,253,225,212,186,187,184,190,171,146,121,103,104,109,114,383,296,180,183]
["I03","NV <20 anos","A402","R04","ALENTEJO CENTRAL I","ACES Alentejo Central I","I03R04",54,56,44,44,41,36,29,44,38,17,30,16,18,12,14,19,154,144,129,121,106,109,111,99,85,63,64,46,44,45,239,164,90,79]
["I03","NV <20 anos","A403","R05","ALENTEJO CENTRAL II","ACES Alentejo Central II","I03R05",96,96,76,86,86,92,78,70,60,68,57,64,39,39,37,39,268,258,248,264,256,240,208,198,185,189,160,142,115,115,440,368,236,218]
["I03","NV <20 anos","A904","R06","ALTO ALENTEJO","ULS Norte Alentejano","I03R06",104,108,98,97,113,92,106,88,67,72,62,53,47,54,60,41,310,303,308,302,311,286,261,227,201,187,162,154,161,155,520,425,276,255]
["I03","NV <20 anos","A905","R07","BAIXO ALENTEJO","ULS Baixo Alentejo","I03R07",147,161,126,134,117,104,106,101,102,89,74,85,87,72,73,84,434,421,377,355,327,311,309,292,265,248,246,244,232,229,685,502,391,401]
["I04","Proporção NV <20 anos","CT","R01","CONTINENTE","Continente","I04R01",6.9114866689817491,6.5569760769151166,6.3421207782363345,6.1262925005256852,6.0122840148961334,5.8565538744729011,5.6390490979000303,5.2253558249868215,5.095393431356416,4.8182169793076772,4.4507737205780593,4.5076089760123805,4.1713356956095984,4.163309444043934,3.8758802908470558,3.6324972737186476,6.6005100623690121,6.3397377665198098,6.1570719392151858,5.9997934248339799,5.8386104412038211,5.5742701065430982,5.3239669785637629,5.0479133182728839,4.7920976889590854,4.5957781495577521,4.3757926241566478,4.2810000482249766,4.0706148925440573,3.8928681549633715,6.3808215775787129,5.3323149467810902,4.2357122875150157,4.0751747922675206]
["I04","Proporção NV <20 anos","RA","R02","REGIÃO ALENTEJO","Região Alentejo","I04R02",11.313453221033463,10.614166488337256,9.1553836234687296,9.1510238907849839,8.7693595646714115,8.5914537644132949,8.5406119304424397,7.874700891886012,7.1802706241815795,6.6071428571428577,6.2652364700146279,6.3765941485371345,5.3247373447946513,5.2501238236750867,5.4523522316043422,5.3789731051344738,10.343319483927401,9.6403596403596392,9.0233019335646993,8.841529267765857,8.6364959254947617,8.3314900833149004,7.8632852353884273,7.2260048319789147,6.7000911577028255,6.4223829584293775,5.9809585808446579,5.6441717791411046,5.343141217363188,5.3613623400961457,9.7778736251887004,7.7569060773480665,5.7297772567409142,5.5522971652003914]
["I04","Proporção NV <20 anos","A401","R03","ALENTEJO LITORAL","ACES Alentejo Litoral","I04R03",12.920592193808883,9.6153846153846168,10.539845758354756,8.19277108433735,7.7210460772104614,7.1337579617834397,8.6792452830188669,7.0828331332533008,7.192575406032482,6.0901339829476253,4.5454545454545459,4.9333333333333336,3.9263803680981599,4.4359949302915087,5.0970873786407767,4.441776710684274,10.995219469795741,9.4221105527638205,8.7930319369556198,7.6923076923076925,7.847251363827108,7.6253626191462907,7.6305220883534144,6.7965023847376793,6.0057589469354173,5.2177662785683481,4.4530912235192393,4.4180118946474085,4.4892915980230645,4.6606704824202785,9.735638027452973,7.2265625,4.5848191543555776,4.5624532535527296]
["I04","Proporção NV <20 anos","A402","R04","ALENTEJO CENTRAL I","ACES Alentejo Central I","I04R04",10.953346855983773,11.045364891518737,9.3220338983050848,9.1858037578288094,8.5416666666666661,7.9822616407982254,6.3043478260869561,9.1858037578288094,8.3516483516483504,4.4155844155844157,7.389162561576355,4.1558441558441555,4.4887780548628431,3.2697547683923704,3.7135278514588856,4.6683046683046676,10.461956521739131,9.8765432098765427,9.0146750524109009,8.5815602836879439,7.6204169662113586,7.8417266187050361,7.9626972740315631,7.5056861258529191,6.8218298555377217,5.3571428571428568,5.3691275167785237,3.9895923677363401,3.8427947598253276,3.9096437880104258,9.8313451254627733,7.3542600896860986,4.6487603305785123,4.0784718637067634]
["I04","Proporção NV <20 anos","A403","R05","ALENTEJO CENTRAL II","ACES Alentejo Central II","I04R05",9.667673716012084,8.7431693989071047,7.0829450139794972,7.8971533516988064,7.7338129496402885,8.9233753637245385,7.2761194029850751,6.4102564102564097,5.4347826086956523,6.3138347260909926,5.3977272727272725,6.5911431513903187,3.857566765578635,4.1489361702127656,3.923647932131495,4.0752351097178678,8.470290771175728,7.9141104294478533,7.574832009773977,8.1683168316831694,7.9626749611197507,7.511737089201878,6.3647490820073438,6.0494958753437214,5.7151683657707748,6.088917525773196,5.2666227781435158,4.85968514715948,3.9737387698686941,4.0492957746478879,8.2013047530288912,6.8452380952380958,4.7957732168258485,4.5209456656988802]
["I04","Proporção NV <20 anos","A904","R06","ALTO ALENTEJO","ULS Norte Alentejano","I04R06",9.8484848484848477,9.7472924187725631,9.1162790697674403,8.4055459272097046,9.8517872711421095,8.8888888888888893,10.076045627376425,8.6699507389162562,6.8437180796731365,7.2072072072072073,7.2855464159811989,6.6084788029925194,5.2455357142857144,6.1433447098976108,6.5645514223194743,4.6750285062713797,9.5708552022229085,9.0800119868145046,9.1232227488151665,9.0527577937649895,9.616573902288188,9.2198581560283674,8.5686145764937613,7.5843635148680253,7.1049840933191941,7.0512820512820511,6.3554335033346412,5.9759410166860691,5.9873558943845291,5.8052434456928843,9.3862815884476536,8.3661417322834648,6.3565177337632424,5.8379120879120876]
["I04","Proporção NV <20 anos","A905","R07","BAIXO ALENTEJO","ULS Baixo Alentejo","I04R07",13.267148014440433,13.644067796610168,10.039840637450199,11.795774647887324,9.4660194174757279,9.2774308652988395,9.1065292096219927,8.5738539898132426,8.6294416243654819,7.4290484140233719,7.1085494716618642,7.7910174152153981,8.169014084507042,6.7732831608654749,6.7157313707451705,8.2677165354330722,12.249506068303697,11.789414729767572,10.394265232974909,10.163183509876896,9.287134336836127,8.980652613341034,8.7684449489216796,8.206857785272625,7.7462730195849163,7.4474474474474475,7.6947137941820456,7.5799937868903395,7.2161741835147746,7.2331017056222358,11.58072696534235,8.5914769810029092,7.3125116887974562,7.5347613679068015]
["I05","NV >=35 anos","CT","R01","CONTINENTE","Continente","I05R01",10786,11696,12459,13900,14974,14861,15577,15961,16244,16965,17413,17905,19094,19415,21147,22106,34941,38055,41333,43735,45412,46399,47782,49170,50622,52283,54412,56414,59656,62668,63815,79608,94974,99667]
["I05","NV >=35 anos","RA","R02","REGIÃO ALENTEJO","Região Alentejo","I05R02",407,462,476,529,610,579,549,637,665,648,648,633,738,740,806,862,1345,1467,1615,1718,1738,1765,1851,1950,1961,1929,2019,2111,2284,2408,2484,3078,3565,3779]
["I05","NV >=35 anos","A401","R03","ALENTEJO LITORAL","ACES Alentejo Litoral","I05R03",83,91,95,119,115,114,109,133,150,108,121,112,148,124,155,174,269,305,329,348,338,356,392,391,379,341,381,384,427,453,503,614,660,713]
["I05","NV >=35 anos","A402","R04","ALENTEJO CENTRAL I","ACES Alentejo Central I","I05R04",38,50,38,51,45,53,58,59,54,50,56,56,64,68,82,86,126,139,134,149,156,170,171,163,160,162,176,188,214,236,222,274,326,356]
["I05","NV >=35 anos","A403","R05","ALENTEJO CENTRAL II","ACES Alentejo Central II","I05R05",86,114,97,131,136,133,114,134,159,150,159,142,190,191,208,215,297,342,364,400,383,381,407,443,468,451,491,523,589,614,564,690,890,946]
["I05","NV >=35 anos","A904","R06","ALTO ALENTEJO","ULS Norte Alentejano","I05R06",104,102,104,117,156,133,126,126,143,145,127,138,150,167,145,186,310,323,377,406,415,385,395,414,415,410,415,455,462,498,583,673,727,786]
["I05","NV >=35 anos","A905","R07","BAIXO ALENTEJO","ULS Baixo Alentejo","I05R07",96,105,142,111,158,146,142,185,159,195,185,185,186,190,216,201,343,358,411,415,446,473,486,539,539,565,556,561,592,607,612,827,962,978]
["I06","Proporção NV >=35 anos","CT","R01","CONTINENTE","Continente","I06R01",10.404367789481807,11.002925709555122,11.659507566186585,12.707874310894946,13.214140736687904,13.956742644089445,14.397552499260573,15.024663001732058,15.72370267837265,16.403983755559853,17.46311915196614,18.473046169718856,19.275770515965554,20.583308595903482,21.997649090322781,24.106870229007633,11.02852056662374,11.798646356852082,12.542026241367173,13.286124832157679,13.845586284905897,14.458886330137144,15.038412755363781,15.711222804119362,16.519276078344351,17.424297969059317,18.401393327584167,19.432598706192774,20.605566570183136,22.210329710055042,11.828040695206692,15.087788458622676,19.535865326070859,20.844775264096842]
["I06","Proporção NV >=35 anos","RA","R02","REGIÃO ALENTEJO","Região Alentejo","I06R02",9.2647393580696562,9.886582495185106,10.22995916612938,11.284129692832764,12.766848053578903,13.090662446303414,12.084525643847678,13.856863171633673,14.513312963771281,14.464285714285715,15.797172111165287,15.828957239309826,17.621776504297994,18.325903912828132,19.445114595898673,21.075794621026894,9.8039215686274517,10.468103325246183,11.43848714498194,12.369501043991649,12.645518044237486,13.013345130133452,13.489287275907301,14.276301339775971,14.896687936797326,15.332644463874095,16.429327040442672,17.267893660531698,18.462533344111229,19.620304733968872,10.713823592840198,13.604419889502761,17.414028917545917,18.470185728250243]
["I06","Proporção NV >=35 anos","A401","R03","ALENTEJO LITORAL","ACES Alentejo Litoral","I06R03",11.170928667563929,11.666666666666666,12.210796915167094,14.337349397590362,14.32129514321295,14.522292993630574,13.710691823899371,15.966386554621847,17.40139211136891,13.15468940316687,16.176470588235293,14.933333333333335,18.159509202453989,15.716096324461343,18.810679611650485,20.888355342136855,11.690569317687961,12.772194304857621,13.645790128577353,14.392059553349876,14.183801930339907,14.75341898052217,15.742971887550199,15.54054054054054,15.590292060880294,14.704614057783527,16.472114137483786,16.312659303313509,17.586490939044481,18.520032706459524,12.785968479918658,14.990234375,16.811003565970452,17.776115681874842]
["I06","Proporção NV >=35 anos","A402","R04","ALENTEJO CENTRAL I","ACES Alentejo Central I","I06R04",7.7079107505070992,9.8619329388560164,8.0508474576271176,10.647181628392484,9.375,11.751662971175167,12.608695652173912,12.31732776617954,11.868131868131867,12.987012987012985,13.793103448275861,14.545454545454545,15.96009975062344,18.528610354223432,21.750663129973475,21.13022113022113,8.5597826086956523,9.5336076817558304,9.3640810621942698,10.567375886524824,11.214953271028037,12.23021582733813,12.266857962697273,12.357846853677028,12.841091492776885,13.77551020408163,14.76510067114094,16.305290546400695,18.689956331877731,20.50390964378801,9.1320444261620732,12.286995515695068,16.83884297520661,18.378936499741869]
["I06","Proporção NV >=35 anos","A403","R05","ALENTEJO CENTRAL II","ACES Alentejo Central II","I06R05",8.6606243705941601,10.382513661202186,9.040074557315938,12.029384756657484,12.23021582733813,12.900096993210475,10.634328358208956,12.27106227106227,14.402173913043478,13.92757660167131,15.056818181818182,14.62409886714727,18.793273986152325,20.319148936170212,22.057264050901377,22.466039707419018,9.3868520859671296,10.490797546012271,11.117898594990837,12.376237623762377,11.912908242612753,11.924882629107982,12.454100367197062,13.534983195844791,14.457831325301203,14.529639175257733,16.161948650427913,17.898699520876114,20.352453351762268,21.619718309859152,10.512581547064306,12.834821428571427,18.08575492786019,19.618415595188718]
["I06","Proporção NV >=35 anos","A904","R06","ALTO ALENTEJO","ULS Norte Alentejano","I06R06",9.8484848484848477,9.2057761732851997,9.6744186046511622,10.138648180242635,13.600697471665214,12.85024154589372,11.977186311787072,12.413793103448276,14.606741573033707,14.514514514514515,14.923619271445359,17.206982543640898,16.741071428571427,18.998862343572238,15.864332603938729,21.20866590649943,9.5708552022229085,9.6793527120167813,11.167061611374407,12.170263788968825,12.832405689548546,12.411347517730496,12.967826657912015,13.832275309054459,14.669494521032167,15.460030165912519,16.280894468418989,17.656189367481566,17.181108218668651,18.651685393258425,10.523465703971119,13.248031496062993,16.743436204514047,17.994505494505493]
["I06","Proporção NV >=35 anos","A905","R07","BAIXO ALENTEJO","ULS Baixo Alentejo","I06R07",8.6642599277978327,8.898305084745763,11.314741035856574,9.77112676056338,12.7831715210356,13.02408563782337,12.199312714776632,15.704584040747029,13.451776649746192,16.277128547579299,17.77137367915466,16.956920256645279,17.464788732394364,17.873941674506113,19.871205151793927,19.783464566929133,9.6810612475303408,10.025203024362924,11.331679073614557,11.880904666475809,12.666856006816246,13.658677447300031,13.791146424517594,15.148960089938168,15.755627009646304,16.966966966966968,17.391304347826086,17.42777260018639,18.413685847589427,19.172457359444092,10.346576500422653,14.15368817388328,17.991397045072002,18.376550169109358]
["I07","Nascimentos pré-termo","CT","R01","CONTINENTE","Continente","I07R01","na","na","na","na",6726,6041,7001,7347,7050,6814,7900,8801,8922,8289,7452,6890,"na","na","na","na",19768,20389,21398,21211,21764,23515,25623,26012,24663,22631,6726,34253,41364,40354]
["I07","Nascimentos pré-termo","RA","R02","REGIÃO ALENTEJO","Região Alentejo","I07R02","na","na","na","na",295,258,307,308,306,322,303,396,354,326,324,266,"na","na","na","na",860,873,921,936,931,1021,1053,1076,1004,916,295,1501,1703,1666]
["I07","Nascimentos pré-termo","A401","R03","ALENTEJO LITORAL","ACES Alentejo Litoral","I07R03","na","na","na","na",44,40,47,54,75,54,78,72,70,62,63,56,"na","na","na","na",131,141,176,183,207,204,220,204,195,181,44,270,345,323]
["I07","Nascimentos pré-termo","A402","R04","ALENTEJO CENTRAL I","ACES Alentejo Central I","I07R04","na","na","na","na",28,30,37,28,29,31,25,40,40,31,35,19,"na","na","na","na",95,95,94,88,85,96,105,111,106,85,28,155,171,165]
["I07","Nascimentos pré-termo","A403","R05","ALENTEJO CENTRAL II","ACES Alentejo Central II","I07R05","na","na","na","na",57,69,84,71,70,76,69,91,79,73,67,61,"na","na","na","na",210,224,225,217,215,236,239,243,219,201,57,370,379,371]
["I07","Nascimentos pré-termo","A904","R06","ALTO ALENTEJO","ULS Norte Alentejano","I07R06","na","na","na","na",76,54,59,70,54,70,61,82,57,67,62,61,"na","na","na","na",189,183,183,194,185,213,200,206,186,190,76,307,329,329]
["I07","Nascimentos pré-termo","A905","R07","BAIXO ALENTEJO","ULS Baixo Alentejo","I07R07","na","na","na","na",90,65,80,85,78,91,70,111,108,93,97,69,"na","na","na","na",235,230,243,254,239,272,289,312,298,259,90,399,479,478]
["I08","Proporção nascimentos pré-termo","CT","R01","CONTINENTE","Continente","I08R01",0,0,0,0,5.9355089217953019,5.6734191718554827,6.4709035788228331,6.9159951803599666,6.8241876312809149,6.5886675691355627,7.9227382588027639,9.0802166623678104,9.0069354008298248,8.7877952588948727,7.7517605816941115,7.5136314067611769,0,0,0,0,6.027031394345542,6.3536333409161028,6.7345853279325727,6.7775217998408746,7.1021596256387838,7.8368182151450725,8.6653477400700041,8.9602006159018419,8.5187590237432396,8.0207118731769906,1.2466567690348695,6.4918352184856118,8.5084500320887297,8.4398051612606366]
["I08","Proporção nascimentos pré-termo","RA","R02","REGIÃO ALENTEJO","Região Alentejo","I08R02",0,0,0,0,6.1741314357471744,5.8331449242595523,6.7576491305304867,6.7000217533173814,6.6783064164120471,7.1874999999999991,7.3866406630911747,9.9024756189047256,8.4527220630372497,8.0733036156513123,7.8166465621230401,6.5036674816625926,0,0,0,0,6.257275902211874,6.4366290643662909,6.7118495846086574,6.8526246430924669,7.0723184442418718,8.1154121294014772,8.5686386199039788,8.8016359918200404,8.1157545873413639,7.463537847307097,1.2723743799870606,6.6342541436464089,8.3186791715513859,8.1427174975562071]
["I08","Proporção nascimentos pré-termo","A401","R03","ALENTEJO LITORAL","ACES Alentejo Litoral","I08R03",0,0,0,0,5.4794520547945202,5.095541401273886,5.9119496855345917,6.4825930372148859,8.700696055684455,6.577344701583435,10.427807486631016,9.6,8.5889570552147241,7.8580481622306717,7.6456310679611645,6.7226890756302522,0,0,0,0,5.4972723457826271,5.8433485288023208,7.068273092369477,7.2734499205087442,8.5150143973673398,8.796895213454075,9.5114569822741029,8.6661002548853023,8.0313014827018119,7.3998364677023716,1.1184544992374175,6.591796875,8.7875700458481916,8.0528546497132876]
["I08","Proporção nascimentos pré-termo","A402","R04","ALENTEJO CENTRAL I","ACES Alentejo Central I","I08R04",0,0,0,0,5.833333333333333,6.651884700665188,8.0434782608695645,5.8455114822546967,6.3736263736263732,8.0519480519480524,6.1576354679802954,10.38961038961039,9.9750623441396513,8.4468664850136239,9.2838196286472154,4.6683046683046676,0,0,0,0,6.8296189791516904,6.8345323741007196,6.7431850789096126,6.6717210007581507,6.8218298555377217,8.1632653061224492,8.8087248322147644,9.6270598438855153,9.2576419213973811,7.3848827106863597,1.1517893870835048,6.9506726457399113,8.8326446280991728,8.5183273102736177]
["I08","Proporção nascimentos pré-termo","A403","R05","ALENTEJO CENTRAL II","ACES Alentejo Central II","I08R05",0,0,0,0,5.1258992805755392,6.6925315227934048,7.8358208955223887,6.5018315018315027,6.3405797101449277,7.0566388115134631,6.5340909090909092,9.3717816683831092,7.8140454995054398,7.7659574468085104,7.1049840933191941,6.3740856844305123,0,0,0,0,6.5318818040435458,7.0109546165884193,6.8849449204406357,6.6300030553009464,6.6419524250849555,7.6030927835051543,7.8670177748518766,8.3162217659137578,7.5673807878369042,7.0774647887323949,1.0624417520969245,6.8824404761904763,7.7016866490550697,7.6939029448361671]
["I08","Proporção nascimentos pré-termo","A904","R06","ALTO ALENTEJO","ULS Norte Alentejano","I08R06",0,0,0,0,6.6259808195292065,5.2173913043478262,5.6083650190114067,6.8965517241379306,5.5158324821246172,7.0070070070070072,7.1680376028202115,10.224438902743142,6.3616071428571423,7.6222980659840731,6.7833698030634579,6.955530216647662,0,0,0,0,5.8441558441558437,5.8994197292069632,6.0078791858174654,6.4817908453057127,6.5394132202191591,8.0316742081447963,7.8462142016477054,7.9937912301125333,6.9170695425808848,7.1161048689138573,1.371841155234657,6.0433070866141732,7.5771533855366195,7.5320512820512819]
["I08","Proporção nascimentos pré-termo","A905","R07","BAIXO ALENTEJO","ULS Baixo Alentejo","I08R07",0,0,0,0,7.2815533980582519,5.7983942908117747,6.8728522336769764,7.2156196943972839,6.5989847715736047,7.5959933222036726,6.7243035542747354,10.174152153987167,10.140845070422536,8.7488240827845711,8.9236430542778287,6.7913385826771657,0,0,0,0,6.6742402726498158,6.6416401963615366,6.8955732122587969,7.1388420460933109,6.9862613270973402,8.168168168168167,9.0397247419455731,9.6924510717614165,9.26905132192846,8.1806696146557165,1.521555367709214,6.8286838952592843,8.9582943706751443,8.9815858699736939]
["I09","Baixo Peso à Nascença","CT","R01","CONTINENTE","Continente","I09R01",6600,6923,7148,8127,8031,7645,7937,7862,7850,7779,7547,7623,7640,7724,8035,7733,20671,22198,23306,23803,23613,23444,23649,23491,23176,22949,22810,22987,23399,23492,36829,39073,38569,38755]
["I09","Baixo Peso à Nascença","RA","R02","REGIÃO ALENTEJO","Região Alentejo","I09R02",283,320,335,371,369,339,327,332,375,345,361,325,359,347,390,346,938,1026,1075,1079,1035,998,1034,1052,1081,1031,1045,1031,1096,1083,1678,1718,1782,1767]
["I09","Baixo Peso à Nascença","A401","R03","ALENTEJO LITORAL","ACES Alentejo Litoral","I09R03",56,51,57,55,60,60,66,61,78,65,74,62,68,65,76,74,164,163,172,175,186,187,205,204,217,201,204,195,209,215,279,330,345,345]
["I09","Baixo Peso à Nascença","A402","R04","ALENTEJO CENTRAL I","ACES Alentejo Central I","I09R04",32,34,38,39,33,33,40,39,38,37,34,24,41,31,32,34,104,111,110,105,106,112,117,114,109,95,99,96,104,97,176,187,162,162]
["I09","Baixo Peso à Nascença","A403","R05","ALENTEJO CENTRAL II","ACES Alentejo Central II","I09R05",54,74,75,89,70,94,79,84,109,80,96,93,93,73,94,88,203,238,234,253,243,257,272,273,285,269,282,259,260,255,362,446,449,441]
["I09","Baixo Peso à Nascença","A904","R06","ALTO ALENTEJO","ULS Norte Alentejano","I09R06",72,90,85,97,98,81,66,77,62,76,78,57,57,79,76,70,247,272,280,276,245,224,205,215,216,211,192,193,212,225,442,362,347,339]
["I09","Baixo Peso à Nascença","A905","R07","BAIXO ALENTEJO","ULS Baixo Alentejo","I09R07",69,71,80,91,108,71,76,71,88,87,79,89,100,99,112,80,220,242,279,270,255,218,235,246,254,255,268,288,311,291,419,393,479,480]
["I10","Proporção de Baixo Peso à Nascença","CT","R01","CONTINENTE","Continente","I10R01",6.3664776015742568,6.5127611736704951,6.6893137557670528,7.4299924118448368,7.0871353183077703,7.1798194949238825,7.3360322389825496,7.4007831915053846,7.5985635327028618,7.5217559466254107,7.5687222328081587,7.8648439515088988,7.7127310538376888,8.1887960646283027,8.3582120603746901,8.4329334787350057,6.524442592732874,6.882311176702208,7.071939215186493,7.231042171712569,7.1993268066916878,7.3056344128911226,7.4430417992465374,7.5060470793485452,7.5629319740766601,7.6481880169833829,7.7140296589391104,7.9181966614537762,8.0821652838895535,8.3258611340494841,6.8262150084426434,7.4053506989720104,7.9335269627606175,8.1053835809252117]
["I10","Proporção de Baixo Peso à Nascença","RA","R02","REGIÃO ALENTEJO","Região Alentejo","I10R02",6.4420669246528561,6.8478493473143596,7.1996561358263484,7.9138225255972694,7.7228966094600251,7.6644811214108071,7.1978868589038081,7.2221013704589954,8.1841990397206459,7.7008928571428577,8.8005850804485615,8.1270317579394842,8.5721107927411655,8.5933630510153538,9.408926417370326,8.4596577017114907,6.8372330344777312,7.3212501783930346,7.6138536723563996,7.7687378500971986,7.5305587892898718,7.3582540735825406,7.5353447019384925,7.7018815433047809,8.2117897295654814,8.194897067005801,8.5035397509968256,8.4335378323108383,8.859429310484197,8.8242483500366653,7.23743799870606,7.5933701657458563,8.7045720984759676,8.6363636363636367]
["I10","Proporção de Baixo Peso à Nascença","A401","R03","ALENTEJO LITORAL","ACES Alentejo Litoral","I10R03",7.5370121130551819,6.5384615384615392,7.3264781491002573,6.6265060240963862,7.4719800747198004,7.6433121019108281,8.3018867924528301,7.3229291716686671,9.0487238979118327,7.917174177831912,9.8930481283422473,8.2666666666666657,8.3435582822085887,8.2382762991128011,9.2233009708737868,8.8835534213685481,7.1273359408952626,6.8257956448911221,7.1339693073413519,7.2373862696443343,7.8052874527906004,7.7496891835888944,8.2329317269076299,8.1081081081081088,8.9263677498971621,8.6675291073738681,8.8197146562905324,8.2837723024638912,8.6079077429983517,8.7898609975470148,7.0920183019827148,8.056640625,8.7875700458481916,8.6013462976813759]
["I10","Proporção de Baixo Peso à Nascença","A402","R04","ALENTEJO CENTRAL I","ACES Alentejo Central I","I10R04",6.4908722109533468,6.7061143984220903,8.0508474576271176,8.1419624217119004,6.8750000000000009,7.3170731707317067,8.695652173913043,8.1419624217119004,8.3516483516483504,9.6103896103896105,8.3743842364532011,6.2337662337662341,10.224438902743142,8.4468664850136239,8.4880636604774526,8.3538083538083541,7.0652173913043477,7.6131687242798352,7.6869322152341022,7.4468085106382977,7.6204169662113586,8.057553956834532,8.3931133428981362,8.6429112964366954,8.7479935794542545,8.0782312925170068,8.3053691275167782,8.3261058109280146,9.0829694323144103,8.4274543874891403,7.2398190045248878,8.3856502242152473,8.3677685950413228,8.3634486319050065]
["I10","Proporção de Baixo Peso à Nascença","A403","R05","ALENTEJO CENTRAL II","ACES Alentejo Central II","I10R05",5.4380664652567976,6.7395264116575593,6.9897483690587139,8.172635445362717,6.2949640287769784,9.1173617846750723,7.3694029850746272,7.6923076923076925,9.8731884057971016,7.4280408542246974,9.0909090909090917,9.5777548918640569,9.1988130563798212,7.7659574468085104,9.9681866383881221,9.1954022988505741,6.4159292035398234,7.3006134969325149,7.1472205253512531,7.8279702970297027,7.558320373250389,8.0438184663536774,8.3231334149326806,8.3409715857011921,8.8044485634847085,8.6662371134020617,9.2824226464779453,8.8637919233401785,8.9841050449205255,8.97887323943662,6.7474370922646782,8.2961309523809526,9.1241617557407029,9.1455827457486532]
["I10","Proporção de Baixo Peso à Nascença","A904","R06","ALTO ALENTEJO","ULS Norte Alentejano","I10R06",6.8181818181818175,8.1227436823104693,7.9069767441860463,8.4055459272097046,8.5440278988666094,7.8260869565217401,6.2737642585551328,7.5862068965517242,6.3329928498467831,7.6076076076076085,9.1656874265569908,7.1072319201995011,6.3616071428571423,8.9874857792946532,8.3150984682713336,7.9817559863169896,7.6258104353195426,8.1510338627509746,8.293838862559241,8.2733812949640289,7.5757575757575761,7.2211476466795617,6.7301378857518053,7.1834279986635483,7.6352067868504774,7.9562594268476614,7.5323656335817972,7.4893286767559175,7.883971736705095,8.4269662921348321,7.9783393501805051,7.1259842519685037,7.9917088899124824,7.7609890109890109]
["I10","Proporção de Baixo Peso à Nascença","A905","R07","BAIXO ALENTEJO","ULS Baixo Alentejo","I10R07",6.2274368231046928,6.0169491525423728,6.3745019920318722,8.01056338028169,8.7378640776699026,6.3336306868867087,6.5292096219931279,6.0271646859083194,7.4450084602368864,7.2621035058430721,7.5888568683957729,8.1576535288725935,9.3896713615023462,9.313264346190028,10.303587856485741,7.8740157480314963,6.2094270392322892,6.7768132175861098,7.6923076923076925,7.7297452046951047,7.2422607213859695,6.2951198382904998,6.6685584562996603,6.9139966273187179,7.4247296112247883,7.6576576576576567,8.3828589302471066,8.9468779123951538,9.6734059097978236,9.1914087176247641,7.0836855452240073,6.7259969193907239,8.9582943706751443,9.0191657271702361]
["I11","Índice sintético de fecundidade (ISF)","CT","R01","CONTINENTE","Continente","I11R01",1.430507731594074,1.4679288630178684,1.4637594982914837,1.4962981940770692,1.5472896537816896,1.4469283079890394,1.4634999121024463,1.4332475342263216,1.3970947804939711,1.4046959859236119,5.6736516992738961E-2,1.3362079621269598,1.379282825499224,1.3315990813610639,1.3784335607715392,1.3061603200181457,"na","na","na","na","na","na","na","na","na","na","na","na","na","na","na","na","na","na"]
["I11","Índice sintético de fecundidade (ISF)","RA","R02","REGIÃO ALENTEJO","Região Alentejo","I11R02",1.3116590097766627,1.3995163895268761,1.4053687644051407,1.4241955472817605,1.4544793358989501,1.3433136495503188,1.3775001047586575,1.3957318296034498,1.3952553471110603,1.3705431282879126,1.2617072196897632,1.2444667684510495,1.310492874331054,1.2858276589555724,1.3481265036763188,1.3246993141546546,"na","na","na","na","na","na","na","na","na","na","na","na","na","na","na","na","na","na"]
["I11","Índice sintético de fecundidade (ISF)","A401","R03","ALENTEJO LITORAL","ACES Alentejo Litoral","I11R03",1.2439787709980035,1.3236296305397501,1.303762165724645,1.39173134864639,1.3524776536541498,1.3104250324993649,1.3292424076792548,1.3825749567799563,1.4286418759331994,1.3522151853904876,1.2346775098545304,1.2404156725645998,1.3552773066394488,1.3119843811471479,1.4179258768230083,1.4283019821576108,"na","na","na","na","na","na","na","na","na","na","na","na","na","na","na","na","na","na"]
["I11","Índice sintético de fecundidade (ISF)","A402","R04","ALENTEJO CENTRAL I","ACES Alentejo Central I","I11R04",1.3110110495941867,1.3733589469209235,1.2866021739424665,1.326066841089796,1.3248773073726468,1.2449364574513915,1.2695929272164879,1.3448918020145764,1.2874002270242908,1.0841673644225676,1.1613297224711587,1.1119617530581412,1.1742326167494774,1.098979336993456,1.1367560960892988,1.2288222801870554,"na","na","na","na","na","na","na","na","na","na","na","na","na","na","na","na","na","na"]
["I11","Índice sintético de fecundidade (ISF)","A403","R05","ALENTEJO CENTRAL II","ACES Alentejo Central II","I11R05",1.3851483172922838,1.5252128049748215,1.5026310547160755,1.5265104600775257,1.4891257258180821,1.3843023654518536,1.4172831241228396,1.4413627685458166,1.4524826111692655,1.4258622062719724,1.4102145183063022,1.3039853121250404,1.3495130366997707,1.2836860011883755,1.3095810748121226,1.3276197614743905,"na","na","na","na","na","na","na","na","na","na","na","na","na","na","na","na","na","na"]
["I11","Índice sintético de fecundidade (ISF)","A904","R06","ALTO ALENTEJO","ULS Norte Alentejano","I11R06",1.3208826694467177,1.3987684537407199,1.3729031891046775,1.490748987669448,1.510063470213562,1.3612073063531975,1.3916292061158542,1.3483397759244389,1.3088360272525872,1.3482822631777742,1.1594685019788726,1.1133972766633977,1.2498969753555682,1.2605426906686652,1.3477374774228743,1.2698045860501879,"na","na","na","na","na","na","na","na","na","na","na","na","na","na","na","na","na","na"]
["I11","Índice sintético de fecundidade (ISF)","A905","R07","BAIXO ALENTEJO","ULS Baixo Alentejo","I11R07",1.2889011161478801,1.3705468826903893,1.4776818630361752,1.3459424691000696,1.5076457246580244,1.3613234643914658,1.4109510602252604,1.4336298756875443,1.445191189491029,1.470064910489908,1.2853157025881401,1.3675201915163078,1.3537356936603255,1.3660891442557612,1.4215112858220267,1.3365212105239157,"na","na","na","na","na","na","na","na","na","na","na","na","na","na","na","na","na","na"]
["I12","Óbitos","CT","R01","CONTINENTE","Continente","I12R01",101466,99355,100844,102665,100021,99706,100880,103321,96946,102323,97038,98668,99401,99335,100837,97962,301665,302864,303530,302392,300607,303907,301147,302590,296307,298029,295107,297404,299573,298134,504351,503176,495279,496203]
["I12","Óbitos","RA","R02","REGIÃO ALENTEJO","Região Alentejo","I12R02",7969,7649,7838,7889,7550,7455,7572,7962,7074,7894,7081,7271,7538,7378,7468,7217,23456,23376,23277,22894,22577,22989,22608,22930,22049,22246,21890,22187,22384,22063,38895,37957,36736,36872]
["I12","Óbitos","A401","R03","ALENTEJO LITORAL","ACES Alentejo Litoral","I12R03",1326,1309,1313,1322,1244,1271,1240,1365,1244,1412,1203,1250,1294,1282,1257,1299,3948,3944,3879,3837,3755,3876,3849,4021,3859,3865,3747,3826,3833,3838,6514,6532,6286,6382]
["I12","Óbitos","A402","R04","ALENTEJO CENTRAL I","ACES Alentejo Central I","I12R04",902,863,893,830,795,818,804,861,749,845,774,739,817,809,806,738,2658,2586,2518,2443,2417,2483,2414,2455,2368,2358,2330,2365,2432,2353,4283,4077,3945,3909]
["I12","Óbitos","A403","R05","ALENTEJO CENTRAL II","ACES Alentejo Central II","I12R05",1348,1360,1401,1404,1375,1313,1377,1441,1266,1458,1361,1432,1478,1418,1432,1287,4109,4165,4180,4092,4065,4131,4084,4165,4085,4251,4271,4328,4328,4137,6888,6855,7121,7047]
["I12","Óbitos","A904","R06","ALTO ALENTEJO","ULS Norte Alentejano","I12R06",2096,1994,1979,2036,1972,1993,1927,2069,1830,2044,1798,1864,1852,1893,1914,1887,6069,6009,5987,6001,5892,5989,5826,5943,5672,5706,5514,5609,5659,5694,10077,9863,9321,9410]
["I12","Óbitos","A905","R07","BAIXO ALENTEJO","ULS Baixo Alentejo","I12R07",2297,2123,2252,2297,2164,2060,2224,2226,1985,2135,1945,1986,2097,1976,2059,2006,6672,6672,6713,6521,6448,6510,6435,6346,6065,6066,6028,6059,6132,6041,11133,10630,10063,10124]
["I13","Taxa Bruta de Mortalidade","CT","R01","CONTINENTE","Continente","I13R01",10.599228389209983,10.340119204595007,10.451250926457213,10.591145074392827,10.260041548547093,10.157877744614126,10.20079013653972,10.374066730849643,9.6774626652392612,10.168282021634095,9.6113270199096927,9.7511749554075084,9.8114769337113579,9.7962308056474061,9.9402914157450457,9.7502926968952082,10.46334750916642,10.461206666601385,10.433789804046153,10.335465831495185,10.206100369397229,10.244766579516241,10.083040685633508,10.072831206742256,9.8190072966291968,9.8431698012928397,9.724778971249231,9.7863116514328521,9.849356687969081,9.8291947696909929,10.447952782763256,10.115050822966076,9.7822692141305101,9.8100384140158141]
["I13","Taxa Bruta de Mortalidade","RA","R02","REGIÃO ALENTEJO","Região Alentejo","I13R02",15.092688691752336,14.517495869564598,14.901537303274232,15.023347222328018,14.389613557874835,14.218050153194485,14.452339916286368,15.224277004591949,13.565289427358392,15.195394798262559,13.699862537038095,14.15633886042543,14.792574276855449,14.595623291275466,14.898084375264951,14.15817052189249,14.837385581307526,14.81384311052682,14.771675849385639,14.543874455374972,14.353317166222755,14.631091435252216,14.414805014704593,14.661519043350269,14.153535270540567,14.352373809466206,14.213658098213845,14.513681763307343,14.761797517915596,14.548559766437027,14.785198379957361,14.530549775564506,14.424180291259601,14.518198738516894]
["I13","Taxa Bruta de Mortalidade","A401","R03","ALENTEJO LITORAL","ACES Alentejo Litoral","I13R03",13.745348246586985,13.539161689033692,13.547465138234703,13.601242836713068,12.750539386764654,12.989269289729178,12.657323384404952,13.943012405705909,12.731422255426716,14.496101349513117,12.404235793902023,12.956321648458715,13.500753809476612,13.464406494843196,13.290828059824586,13.269319168496859,13.610507808460028,13.562679248137883,13.298820625342842,13.112950106198834,12.799034703960544,13.196443497193714,13.110722418177204,13.72284695322765,13.211251645415347,13.28788292911009,12.951617223888077,13.306044234076479,13.419129874631087,13.340957399660393,13.435595665710665,13.362463995810423,13.120488918759836,13.295556342576196]
["I13","Taxa Bruta de Mortalidade","A402","R04","ALENTEJO CENTRAL I","ACES Alentejo Central I","I13R04",15.134736064968624,14.558643667496099,15.139057241911285,14.137044165488579,13.588349912829454,14.032439294260938,13.839996557214787,14.876247246339252,13.000425247554826,14.754413228335457,13.610705681678301,13.092738756455571,14.606239385000446,14.605260782437581,14.700920175462596,13.378047675156349,14.944170199368049,14.612233366294674,14.290295028191835,13.919395135903549,13.819957459460696,14.248537416039504,13.906851745701637,14.210300876350123,13.78736139131245,13.823304402880733,13.766983464848401,14.096721990588277,14.637155625103444,14.227623841700302,14.514757065057154,14.100045651361931,14.116358873983319,14.073250024301467]
["I13","Taxa Bruta de Mortalidade","A403","R05","ALENTEJO CENTRAL II","ACES Alentejo Central II","I13R05",12.318714759611431,12.381871483457456,12.703047008527633,12.678059462266068,12.355718900655528,11.737309536899222,12.238640151094323,12.745388530919286,11.15988787221664,12.823331779523127,11.959000224066498,12.592553509558734,13.032877594120215,12.540626589135289,12.707145550946159,11.538358092539962,12.468385254594475,12.58806355385364,12.578408169345094,12.255441496888968,12.110378728633671,12.242230806502519,12.046664601861275,12.242744373555084,11.981351912983415,12.458146810365671,12.527535058619243,12.722077860997778,12.760543738326298,12.264827782488304,12.487751107952512,12.141779855627064,12.565864470066739,12.48517308184636]
["I13","Taxa Bruta de Mortalidade","A904","R06","ALTO ALENTEJO","ULS Norte Alentejano","I13R06",16.469571366832987,15.753630287420796,15.715204599417131,16.24705741531341,15.803624736038596,16.045729927741885,15.591750208348504,16.84195102891378,14.99760284216867,16.876243632190363,14.975595942096582,15.684690597600175,15.763647428831643,16.295575746880555,16.67370841917738,15.931041469674456,15.980809336226327,15.904483110915836,15.921792538006068,16.032422843464136,15.814053357668151,16.158253214316066,15.81182141272355,16.238392609523082,15.616804584820697,15.849075470597548,15.471836291473233,15.912327585717771,16.240796571036626,16.296228456294397,15.998679080976938,16.069197094086999,15.869651271181031,16.065326637455431]
["I13","Taxa Bruta de Mortalidade","A905","R07","BAIXO ALENTEJO","ULS Baixo Alentejo","I13R07",16.983992014492216,15.783271813515031,16.823107120312859,17.251155647181196,16.326222674890136,15.592240211327837,16.878405658515856,16.95405800633683,15.188381844336302,16.422192651164938,15.060124352492084,15.498673326049632,16.523846108386028,15.726223637087148,16.553376398374407,15.833675370189122,16.530481792189644,16.616711101591811,16.800918006364476,16.392041526840366,16.265146097487452,16.473547430404956,16.342691121867968,16.188982002321456,15.557345426935626,15.662439064694704,15.689887856864912,15.915523479928289,16.26771156381734,16.035463299068958,16.63339887287918,16.207282451919411,15.866433734027927,16.02469233508765]
["I14","Óbitos Infantis","CT","R01","CONTINENTE","Continente","I14R01",683,664,624,592,597,514,534,432,388,353,326,329,324,338,236,285,1971,1880,1813,1703,1645,1480,1354,1173,1067,1008,979,991,898,859,3160,2221,1553,1512]
["I14","Óbitos Infantis","RA","R02","REGIÃO ALENTEJO","Região Alentejo","I14R02",23,24,21,19,25,16,22,25,20,16,14,16,17,24,9,8,68,64,65,60,63,63,67,61,50,46,47,57,50,41,112,99,80,74]
["I14","Óbitos Infantis","A401","R03","ALENTEJO LITORAL","ACES Alentejo Litoral","I14R03",7,2,5,3,4,6,6,9,2,4,2,3,3,6,0,1,14,10,12,13,16,21,17,15,8,9,8,12,9,7,21,27,14,13]
["I14","Óbitos Infantis","A402","R04","ALENTEJO CENTRAL I","ACES Alentejo Central I","I14R04",2,4,3,2,1,1,3,1,1,2,0,1,0,1,2,0,9,9,6,4,5,5,5,4,3,3,1,2,3,3,12,8,4,4]
["I14","Óbitos Infantis","A403","R05","ALENTEJO CENTRAL II","ACES Alentejo Central II","I14R05",6,9,1,4,5,4,4,7,6,2,2,4,1,5,2,2,16,14,10,13,13,15,17,15,10,8,7,10,8,9,25,23,14,14]
["I14","Óbitos Infantis","A904","R06","ALTO ALENTEJO","ULS Norte Alentejano","I14R06",2,4,6,8,4,2,4,3,4,5,5,5,5,4,0,2,12,18,18,14,10,9,11,12,14,15,15,14,9,6,24,18,19,16]
["I14","Óbitos Infantis","A905","R07","BAIXO ALENTEJO","ULS Baixo Alentejo","I14R07",6,5,6,2,11,3,5,5,7,3,5,3,8,8,5,3,17,13,19,16,19,13,17,15,15,11,16,19,21,16,30,23,29,27]
["I15","Taxa de Mortalidade Infantil","CT","R01","CONTINENTE","Continente","I15R01",6.5883396998109349,6.2465310115805419,5.8395799994385014,5.4122745266545378,5.268359836919112,4.827242930530903,4.9356699201419696,4.066571277957677,3.7557231218964464,3.413266292786695,3.2693831295819002,3.3943770956925459,3.270844059480905,3.5833934099486875,2.4549322293073139,3.1079607415485277,6.2211196121505949,5.8287886351023293,5.5013411984609597,5.173492760755579,5.0154121022351354,4.6119855532668748,4.261439636424293,3.7480708458881455,3.4818986953485491,3.3593505255650573,3.3108439439287105,3.4136394011835787,3.1017498290238121,3.0444043564398542,0.20759077926242256,0.1876307729629742,0.1645575869275453,0.15476671009894613]
["I15","Taxa de Mortalidade Infantil","RA","R02","REGIÃO ALENTEJO","Região Alentejo","I15R02",5.2356020942408383,5.135887010485769,4.513217279174726,4.0529010238907848,5.2323147760569277,3.6174542165950712,4.8426150121065374,5.4383293452251467,4.3649061545176782,3.5714285714285712,3.4129692832764507,4.0010002500625159,4.059216809933142,5.9435364041604748,2.1712907117008444,1.9559902200488997,4.9566294919454768,4.5668617097188529,4.6037254763085205,4.3199654402764782,4.583818393480791,4.6449900464498999,4.8826701646990234,4.4659199062888932,3.7982376177453658,3.6563071297989032,3.8245585482952236,4.6625766871165641,4.0417104518632287,3.3406665037073249,0.90575803321112791,1.1933701657458562,0.68386088315748339,0.63538611925708699]
["I15","Taxa de Mortalidade Infantil","A401","R03","ALENTEJO LITORAL","ACES Alentejo Litoral","I15R03",9.4212651413189779,2.5641025641025643,6.4267352185089974,3.6144578313253013,4.9813200498132009,7.6433121019108281,7.5471698113207548,10.804321728691477,2.3201856148491879,4.8721071863580994,2.6737967914438503,4,3.6809815950920246,7.6045627376425857,0,1.2004801920768307,6.0843111690569316,4.1876046901172526,4.9771878888428045,5.3763440860215059,6.714225765841376,8.7028595109821811,6.8273092369477917,5.9618441971383156,3.2908268202385851,3.8809831824062098,3.4587116299178553,5.0977060322854717,3.7067545304777596,2.8618152085036792,3.0503304524656838,1.953125,1.0188487009679064,0.99725754176015957]
["I15","Taxa de Mortalidade Infantil","A402","R04","ALENTEJO CENTRAL I","ACES Alentejo Central I","I15R04",4.056795131845842,7.8895463510848129,6.3559322033898313,4.1753653444676404,2.0833333333333335,2.2172949002217295,6.5217391304347823,2.0876826722338202,2.197802197802198,5.1948051948051948,0,2.5974025974025974,0,2.7247956403269753,5.3050397877984086,0,6.1141304347826093,6.1728395061728394,4.1928721174004195,2.8368794326241136,3.5945363048166787,3.5971223021582737,3.5868005738880919,3.0326004548900682,2.407704654895666,2.5510204081632653,0.83892617449664431,1.7346053772766694,2.6200873362445414,2.6064291920069507,10.283833813245577,10.31390134529148,7.2314049586776861,7.2276716572018582]
["I15","Taxa de Mortalidade Infantil","A403","R05","ALENTEJO CENTRAL II","ACES Alentejo Central II","I15R05",6.0422960725075532,8.1967213114754109,0.93196644920782845,3.6730945821854912,4.4964028776978413,3.8797284190106693,3.7313432835820897,6.4102564102564097,5.4347826086956523,1.8570102135561746,1.893939393939394,4.1194644696189497,0.98911968348170121,5.3191489361702127,2.1208907741251326,2.0898641588296765,5.0568900126422252,4.294478527607362,3.0543677458766036,4.0222772277227721,4.0435458786936236,4.694835680751174,5.2019583843329249,4.5829514207149407,3.0892801977139328,2.5773195876288661,2.3041474654377878,3.4223134839151266,2.7643400138217,3.1690140845070425,4.4734389561975769,3.3482142857142856,3.8610038610038613,3.3181252592285357]
["I15","Taxa de Mortalidade Infantil","A904","R06","ALTO ALENTEJO","ULS Norte Alentejano","I15R06",1.893939393939394,3.6101083032490977,5.5813953488372094,6.932409012131715,3.4873583260680037,1.932367149758454,3.8022813688212929,2.9556650246305423,4.0858018386108279,5.005005005005005,5.8754406580493539,6.2344139650872821,5.5803571428571432,4.5506257110352673,0,2.2805017103762828,3.7048471750540286,5.394066526820497,5.3317535545023702,4.1966426858513186,3.0921459492888066,2.9013539651837523,3.6112934996717003,4.0093551620447707,4.9487451396253093,5.6561085972850673,5.8846606512357784,5.4326736515327898,3.3469691335068799,2.2471910112359552,5.4151624548736459,4.5275590551181102,6.6789497927222481,6.1813186813186807]
["I15","Taxa de Mortalidade Infantil","A905","R07","BAIXO ALENTEJO","ULS Baixo Alentejo","I15R07",5.4151624548736459,4.2372881355932206,4.7808764940239037,1.7605633802816902,8.89967637540453,2.6761819803746651,4.2955326460481107,4.2444821731748732,5.9221658206429781,2.5041736227045073,4.8030739673390972,2.7497708524289641,7.511737089201878,7.5258701787394173,4.5998160073597054,2.9527559055118111,4.798193621224951,3.6404368524222908,5.2384891094568511,4.5805897509304323,5.3961942629934683,3.7539705457695636,4.8240635641316683,4.2158516020236085,4.3846828412744818,3.303303303303303,5.0046918986549898,5.9024541783162467,6.5318818040435458,5.0536955148452298,3.5095651608186403E-2,3.2112061092413866E-2,3.0775684856470038E-2,2.9080554321485555E-2]
["I16","Óbitos Neonatais","CT","R01","CONTINENTE","Continente","I16R01",414,425,389,378,368,300,363,281,256,222,211,198,206,228,157,215,1228,1192,1135,1046,1031,944,900,759,689,631,615,632,591,600,1974,1422,1000,1004]
["I16","Óbitos Neonatais","RA","R02","REGIÃO ALENTEJO","Região Alentejo","I16R02",13,19,13,12,12,12,16,15,18,11,10,9,8,15,5,7,45,44,37,36,40,43,49,44,39,30,27,32,28,27,69,72,47,44]
["I16","Óbitos Neonatais","A401","R03","ALENTEJO LITORAL","ACES Alentejo Litoral","I16R03",3,2,3,1,0,5,4,5,2,2,2,1,2,3,0,1,8,6,4,6,9,14,11,9,6,5,5,6,5,4,9,18,8,7]
["I16","Óbitos Neonatais","A402","R04","ALENTEJO CENTRAL I","ACES Alentejo Central I","I16R04",2,3,2,2,0,0,1,0,1,2,0,1,0,0,2,0,7,7,4,2,1,1,2,3,3,3,1,1,2,2,9,4,3,3]
["I16","Óbitos Neonatais","A403","R05","ALENTEJO CENTRAL II","ACES Alentejo Central II","I16R05",2,6,0,2,4,4,3,5,5,2,1,3,1,3,0,2,8,8,6,10,11,12,13,12,8,6,5,7,4,5,14,19,8,9]
["I16","Óbitos Neonatais","A904","R06","ALTO ALENTEJO","ULS Norte Alentejano","I16R06",2,3,4,5,3,2,3,2,4,3,4,3,3,3,0,1,9,12,12,10,8,7,9,9,11,10,10,9,6,4,17,14,13,10]
["I16","Óbitos Neonatais","A905","R07","BAIXO ALENTEJO","ULS Baixo Alentejo","I16R07",4,5,4,2,5,1,5,3,6,2,3,1,2,6,3,3,13,11,11,8,11,9,14,11,11,6,6,9,11,12,20,17,15,15]
["I17","Taxa de Mortalidade Neonatal","CT","R01","CONTINENTE","Continente","I17R01",3.9935177682602152,3.9981561444604368,3.6403791983679126,3.4558104241138774,3.2474981909317142,2.8174569633448852,3.3551464063886427,2.6451540025604339,2.4780028845502331,2.1465867337072133,2.1160731298827633,2.0428166107815318,2.0796107291761308,2.4172002883677539,1.6331540678018994,2.3446019629225736,3.8759689922480618,3.695700028213817,3.4440277221473741,3.1776121125956172,3.1433981017656079,2.9416988934350878,2.8325669666040354,2.4252223120452712,2.2483863178023902,2.1029267674916183,2.0798457870440825,2.177013220532817,2.0413520589677874,2.1264756855225992,1.6681401905016099E-2,3.4114685993268036E-2,1.6455758692754528E-2,1.4640094198548958E-2]
["I17","Taxa de Mortalidade Neonatal","RA","R02","REGIÃO ALENTEJO","Região Alentejo","I17R02",2.9592533576143869,4.0659105499679011,2.7938964109176876,2.5597269624573378,2.5115110925073254,2.7130906624463034,3.5219018269865727,3.2629976071350879,3.9284155390659103,2.4553571428571428,2.4378352023403216,2.2505626406601649,1.9102196752626552,3.7147102526002969,1.2062726176115801,1.7114914425427872,3.2801224579050952,3.1397174254317113,2.6205821942063885,2.5919792641658868,2.9103608847497093,3.1703900317039002,3.570908030899286,3.221319276667399,2.9626253418413855,2.3845481281297194,2.1970868256164051,2.6175869120654394,2.263357853043408,2.1999511121975068,0.38818201423334053,0.17679558011049723,0.14654161781946071,0.1466275659824047]
["I17","Taxa de Mortalidade Neonatal","A401","R03","ALENTEJO LITORAL","ACES Alentejo Litoral","I17R03",4.0376850605652761,2.5641025641025643,3.8560411311053984,1.2048192771084338,0,6.369426751592357,5.0314465408805029,6.0024009603841542,2.3201856148491879,2.4360535931790497,2.6737967914438503,1.3333333333333333,2.4539877300613497,3.8022813688212929,0,1.2004801920768307,3.4767492394611041,2.512562814070352,1.6590626296142679,2.4813895781637716,3.7767519932857745,5.8019063406547868,4.4176706827309236,3.5771065182829891,2.4681201151789387,2.1561017680034498,2.1616947686986601,2.5488530161427359,2.059308072487644,1.635322976287817,3.5587188612099641,4.638671875,2.0376974019358127,2.2438294689603588]
["I17","Taxa de Mortalidade Neonatal","A402","R04","ALENTEJO CENTRAL I","ACES Alentejo Central I","I17R04",4.056795131845842,5.9171597633136095,4.2372881355932206,4.1753653444676404,0,0,2.1739130434782608,0,2.197802197802198,5.1948051948051948,0,2.5974025974025974,0,0,5.3050397877984086,0,4.7554347826086962,4.8010973936899868,2.7952480782669462,1.4184397163120568,0.71890726096333579,0.71942446043165464,1.4347202295552368,2.274450341167551,2.407704654895666,2.5510204081632653,0.83892617449664431,0.86730268863833471,1.7467248908296944,1.737619461337967,6.9930069930069934,6.2780269058295959,6.7148760330578519,5.1626226122870413]
["I17","Taxa de Mortalidade Neonatal","A403","R05","ALENTEJO CENTRAL II","ACES Alentejo Central II","I17R05",2.0140986908358509,5.4644808743169397,0,1.8365472910927456,3.5971223021582737,3.8797284190106693,2.7985074626865671,4.5787545787545794,4.5289855072463769,1.8570102135561746,0.94696969696969702,3.0895983522142121,0.98911968348170121,3.1914893617021276,0,2.0898641588296765,2.5284450063211126,2.4539877300613497,1.8326206475259621,3.0940594059405941,3.421461897356143,3.755868544600939,3.9779681762545902,3.6663611365719526,2.4714241581711462,1.9329896907216495,1.6458196181698486,2.3956194387405882,1.38217000691085,1.7605633802816902,3.7278657968313138,3.1622023809523809,3.0481609428977849,3.1107424305267526]
["I17","Taxa de Mortalidade Neonatal","A904","R06","ALTO ALENTEJO","ULS Norte Alentejano","I17R06",1.893939393939394,2.7075812274368229,3.7209302325581399,4.3327556325823222,2.6155187445510029,1.932367149758454,2.8517110266159698,1.9704433497536944,4.0858018386108279,3.0030030030030028,4.7003525264394828,3.7406483790523688,3.3482142857142856,3.4129692832764507,0,1.1402508551881414,2.7786353812905218,3.5960443512136648,3.5545023696682461,2.9976019184652278,2.4737167594310452,2.256608639587363,2.9546946815495732,3.0070163715335783,3.8882997525627432,3.7707390648567118,3.9231071008238523,3.4924330616996508,2.2313127556712531,1.4981273408239701,3.0110833763566966E-3,6.7154893687535501E-3,3.7899029693124202E-3,3.3516699172502192E-3]
["I17","Taxa de Mortalidade Neonatal","A905","R07","BAIXO ALENTEJO","ULS Baixo Alentejo","I17R07",3.6101083032490977,4.2372881355932206,3.1872509960159365,1.7605633802816902,4.0453074433656955,0.89206066012488849,4.2955326460481107,2.5466893039049237,5.0761421319796947,1.669449081803005,2.8818443804034581,0.91659028414298815,1.8779342723004695,5.644402634054563,2.7598896044158234,2.9527559055118111,3.6692068868190799,3.0803696443573232,3.0328094844223878,2.2902948754652162,3.1241124680488497,2.5989026855327753,3.9727582292849033,3.0916245081506464,3.215434083601286,1.8018018018018018,1.8767594619956209,2.7958993476234855,3.421461897356143,3.790271636133923,6.5626714156101523E-2,3.0257672447458021E-2,2.7406324634273557E-2,2.7551214953477021E-2]
["I18","Óbitos Neonatais Precoces","CT","R01","CONTINENTE","Continente","I18R01",317,291,293,280,277,219,274,216,172,160,154,152,146,151,108,136,901,864,850,776,770,709,662,548,486,466,452,449,405,395,1458,1041,711,693]
["I18","Óbitos Neonatais Precoces","RA","R02","REGIÃO ALENTEJO","Região Alentejo","I18R02",8,8,9,8,9,9,10,12,15,9,8,7,8,12,4,6,25,25,26,26,28,31,37,36,32,24,23,27,24,22,42,55,39,37]
["I18","Óbitos Neonatais Precoces","A401","R03","ALENTEJO LITORAL","ACES Alentejo Litoral","I18R03",2,1,2,1,0,4,3,3,2,2,2,1,2,3,0,1,5,4,3,5,7,10,8,7,6,5,5,6,5,4,6,14,8,7]
["I18","Óbitos Neonatais Precoces","A402","R04","ALENTEJO CENTRAL I","ACES Alentejo Central I","I18R04",1,3,2,2,0,0,1,0,1,2,0,1,0,0,2,0,6,7,4,2,1,1,2,3,3,3,1,1,2,2,8,4,3,3]
["I18","Óbitos Neonatais Precoces","A403","R05","ALENTEJO CENTRAL II","ACES Alentejo Central II","I18R05",1,2,0,1,2,2,1,4,5,1,1,2,1,2,0,1,3,3,3,5,5,7,10,10,7,4,4,5,3,3,6,13,6,6]
["I18","Óbitos Neonatais Precoces","A904","R06","ALTO ALENTEJO","ULS Norte Alentejano","I18R06",1,0,3,2,3,2,2,2,2,3,2,3,3,2,0,1,4,5,8,7,7,6,6,7,7,8,8,8,5,3,9,11,10,9]
["I18","Óbitos Neonatais Precoces","A905","R07","BAIXO ALENTEJO","ULS Baixo Alentejo","I18R07",3,2,2,2,4,1,3,3,5,1,3,0,2,5,2,3,7,6,8,7,8,7,11,9,9,4,5,7,9,10,13,13,12,12]
["I19","Taxa de Mortalidade Neonatal Precoce","CT","R01","CONTINENTE","Continente","I19R01",3.0578384843924837,2.7375610306776172,2.7419822753773735,2.559859573417687,2.4444483665437087,2.056743583241766,2.5325347530316473,2.0332856389788385,1.6649081880571877,1.5470895378070004,1.5444325213362349,1.5682228527211761,1.4738988663092967,1.6008651032611001,1.123443562564364,1.4830970556161396,2.843850213367674,2.6787624365576663,2.5792278095376813,2.3573871886942626,2.3476397074292126,2.2093903765312257,2.0835103687687462,1.7510168998693127,1.5859444854164899,1.5530330802711474,1.5286021069006916,1.5466438861063843,1.3988960810185345,1.3999298263023776,2.7023871086126077,1.9729660066106682,1.4625055538185587,1.4493693256563467]
["I19","Taxa de Mortalidade Neonatal Precoce","RA","R02","REGIÃO ALENTEJO","Região Alentejo","I19R02",1.821078989301161,1.7119623368285899,1.9342359767891684,1.7064846416382253,1.8836333193804939,2.0348179968347275,2.201188641866608,2.6103980857080704,3.2736796158882582,2.0089285714285712,1.9502681618722573,1.7504376094023506,1.9102196752626552,2.9717682020802374,0.9650180940892642,1.4669926650366749,1.8222902543917197,1.7839303553589267,1.8414901905234082,1.8719850241198071,2.037252619324796,2.2856300228563002,2.6963999416994606,2.6356248627278718,2.4308720753570343,1.9076385025037754,1.8715924810806412,2.2085889570552149,1.9400210168943497,1.7925527580868574,1.8115160664222558,2.430939226519337,1.9050410316529893,1.8084066471163245]
["I19","Taxa de Mortalidade Neonatal Precoce","A401","R03","ALENTEJO LITORAL","ACES Alentejo Litoral","I19R03",2.6917900403768504,1.2820512820512822,2.5706940874035986,1.2048192771084338,0,5.0955414012738851,3.7735849056603774,3.601440576230492,2.3201856148491879,2.4360535931790497,2.6737967914438503,1.3333333333333333,2.4539877300613497,3.8022813688212929,0,1.2004801920768307,2.1729682746631895,1.6750418760469012,1.2442969722107011,2.0678246484698097,2.9374737725556024,4.1442188147534189,3.2128514056224899,2.7821939586645468,2.4681201151789387,2.1561017680034498,2.1616947686986601,2.5488530161427359,2.059308072487644,1.635322976287817,1.5251652262328419,3.41796875,2.0376974019358127,1.7452006980802792]
["I19","Taxa de Mortalidade Neonatal Precoce","A402","R04","ALENTEJO CENTRAL I","ACES Alentejo Central I","I19R04",2.028397565922921,5.9171597633136095,4.2372881355932206,4.1753653444676404,0,0,2.1739130434782608,0,2.197802197802198,5.1948051948051948,0,2.5974025974025974,0,0,5.3050397877984086,0,4.0760869565217392,4.8010973936899868,2.7952480782669462,1.4184397163120568,0.71890726096333579,0.71942446043165464,1.4347202295552368,2.274450341167551,2.407704654895666,2.5510204081632653,0.83892617449664431,0.86730268863833471,1.7467248908296944,1.737619461337967,3.2908268202385851,1.7937219730941705,1.5495867768595042,1.5487867836861124]
["I19","Taxa de Mortalidade Neonatal Precoce","A403","R05","ALENTEJO CENTRAL II","ACES Alentejo Central II","I19R05",1.0070493454179255,1.8214936247723132,0,0.91827364554637281,1.7985611510791368,1.9398642095053347,0.93283582089552242,3.6630036630036629,4.5289855072463769,0.92850510677808729,0.94696969696969702,2.0597322348094749,0.98911968348170121,2.1276595744680851,0,1.0449320794148382,0.94816687737041716,0.92024539877300615,0.91631032376298105,1.5470297029702971,1.5552099533437014,2.1909233176838812,3.0599755201958385,3.0553009471432935,2.162496138399753,1.2886597938144331,1.3166556945358787,1.7111567419575633,1.0366275051831375,1.056338028169014,1.1183597390493942,2.4181547619047619,1.2192643771591138,1.2442969722107011]
["I19","Taxa de Mortalidade Neonatal Precoce","A904","R06","ALTO ALENTEJO","ULS Norte Alentejano","I19R06",0.94696969696969702,0,2.7906976744186047,1.7331022530329288,2.6155187445510029,1.932367149758454,1.9011406844106464,1.9704433497536944,2.042900919305414,3.0030030030030028,2.3501762632197414,3.7406483790523688,3.3482142857142856,2.2753128555176336,0,1.1402508551881414,1.2349490583513429,1.4983518130056939,2.3696682464454977,2.0983213429256593,2.1645021645021645,1.9342359767891684,1.969796454366382,2.3387905111927831,2.4743725698126546,3.0165912518853695,3.1384856806590817,3.1043849437330229,1.859427296392711,1.1235955056179776,1.6245487364620939,2.1653543307086616,2.3030861354214647,2.0604395604395607]
["I19","Taxa de Mortalidade Neonatal Precoce","A905","R07","BAIXO ALENTEJO","ULS Baixo Alentejo","I19R07",2.7075812274368229,1.6949152542372881,1.5936254980079683,1.7605633802816902,3.2362459546925568,0.89206066012488849,2.5773195876288661,2.5466893039049237,4.230118443316413,0.8347245409015025,2.8818443804034581,0,1.8779342723004695,4.7036688617121349,1.8399264029438822,2.9527559055118111,1.9757267852102736,1.6802016241949034,2.2056796250344637,2.0040080160320639,2.2720817949446181,2.0213687554143807,3.1214528944381383,2.5295109612141653,2.630809704764689,1.2012012012012012,1.5639662183296841,2.1745883814849334,2.7993779160186625,3.1585596967782692,2.197802197802198,2.2248844771521479,2.2442491116513934,2.254791431792559]
["I20","Óbitos Pós-Neonatais","CT","R01","CONTINENTE","Continente","I20R01",269,239,235,214,229,214,171,151,132,131,115,131,118,110,79,70,743,688,678,657,614,536,454,414,378,377,364,359,307,259,1186,799,553,508]
["I20","Óbitos Pós-Neonatais","RA","R02","REGIÃO ALENTEJO","Região Alentejo","I20R02",10,5,8,7,13,4,6,10,2,5,4,7,9,9,4,1,23,20,28,24,23,20,18,17,11,16,20,25,22,14,43,27,33,30]
["I20","Óbitos Pós-Neonatais","A401","R03","ALENTEJO LITORAL","ACES Alentejo Litoral","I20R03",4,0,2,2,4,1,2,4,0,2,0,2,1,3,0,0,6,4,8,7,7,7,6,6,2,4,3,6,4,3,12,9,6,6]
["I20","Óbitos Pós-Neonatais","A402","R04","ALENTEJO CENTRAL I","ACES Alentejo Central I","I20R04",0,1,1,0,1,1,2,1,0,0,0,0,0,1,0,0,2,2,2,2,4,4,3,1,0,0,0,1,1,1,3,4,1,1]
["I20","Óbitos Pós-Neonatais","A403","R05","ALENTEJO CENTRAL II","ACES Alentejo Central II","I20R05",4,3,1,2,1,0,1,2,1,0,1,1,0,2,2,0,8,6,4,3,2,3,4,3,2,2,2,3,4,4,11,4,6,5]
["I20","Óbitos Pós-Neonatais","A904","R06","ALTO ALENTEJO","ULS Norte Alentejano","I20R06",0,1,2,3,1,0,1,1,0,2,1,2,2,1,0,1,3,6,6,4,2,2,2,3,3,5,5,5,3,2,7,4,6,6]
["I20","Óbitos Pós-Neonatais","A905","R07","BAIXO ALENTEJO","ULS Baixo Alentejo","I20R07",2,0,2,0,6,2,0,2,1,1,2,2,6,2,2,0,4,2,8,8,8,4,3,4,4,5,10,10,10,4,10,6,14,12]
["I21","Taxa de Mortalidade Pós-Neonatal","CT","R01","CONTINENTE","Continente","I21R01",2.5948219315507197,2.2483748671201047,2.1992008010705897,1.9564641025406606,2.0208616459873983,2.0097859671860179,1.5805235137533273,1.4214172753972438,1.2777202373462138,1.2666795590794817,1.1533099996991365,1.3515604849110137,1.1912333303047742,1.1661931215809338,0.82177816150541438,0.76335877862595414,2.3451506199025327,2.1330886068885122,2.0573134763135856,1.995880648159962,1.872014000469528,1.6702866598317871,1.4288726698202578,1.322848533842875,1.2335123775461587,1.2564237580734392,1.2309981568846278,1.2366261806507617,1.0603977700560248,0.91792867091725527,2.1982380732610101,1.5143130060345089,1.137504319636657,1.0624525504089815]
["I21","Taxa de Mortalidade Pós-Neonatal","RA","R02","REGIÃO ALENTEJO","Região Alentejo","I21R02",2.2763487366264514,1.0699764605178688,1.7193208682570384,1.4931740614334472,2.7208036835496023,0.90436355414876779,1.3207131851199647,2.1753317380900588,0.43649061545176776,1.1160714285714286,0.97513408093612863,1.7504376094023506,2.1489971346704873,2.2288261515601784,0.9650180940892642,0.24449877750611246,1.6765070340403818,1.4271442842871414,1.9831432821021318,1.727986176110591,1.6734575087310826,1.4746000147460001,1.3117621337997378,1.2446006296214949,0.83561227590398057,1.2717590016691835,1.6274717226788185,2.0449897750511248,1.7783525988198206,1.1407153915098183,1.8546474013370713,1.1933701657458562,1.6119577960140681,1.466275659824047]
["I21","Taxa de Mortalidade Pós-Neonatal","A401","R03","ALENTEJO LITORAL","ACES Alentejo Litoral","I21R03",5.3835800807537009,0,2.5706940874035986,2.4096385542168677,4.9813200498132009,1.2738853503184713,2.5157232704402515,4.8019207683073226,0,2.4360535931790497,0,2.6666666666666665,1.2269938650306749,3.8022813688212929,0,0,2.6075619295958279,1.6750418760469012,3.3181252592285357,2.8949545078577335,2.9374737725556024,2.9009531703273934,2.4096385542168677,2.3847376788553256,0.82270670505964627,1.7248814144027598,1.2970168612191959,2.5488530161427359,1.6474464579901154,1.2264922322158627,3.0503304524656838,2.197265625,1.5282730514518594,1.4958863126402393]
["I21","Taxa de Mortalidade Pós-Neonatal","A402","R04","ALENTEJO CENTRAL I","ACES Alentejo Central I","I21R04",0,1.9723865877712032,2.1186440677966103,0,2.0833333333333335,2.2172949002217295,4.3478260869565215,2.0876826722338202,0,0,0,0,0,2.7247956403269753,0,0,1.3586956521739131,1.371742112482853,1.3976240391334731,1.4184397163120568,2.8756290438533432,2.8776978417266186,2.1520803443328549,0.75815011372251706,0,0,0,0.86730268863833471,0.8733624454148472,0.86880973066898348,1.2340600575894694,1.7937219730941705,0.51652892561983477,0.51626226122870422]
["I21","Taxa de Mortalidade Pós-Neonatal","A403","R05","ALENTEJO CENTRAL II","ACES Alentejo Central II","I21R05",4.0281973816717018,2.7322404371584699,0.93196644920782845,1.8365472910927456,0.89928057553956842,0,0.93283582089552242,1.8315018315018314,0.90579710144927539,0,0.94696969696969702,1.0298661174047374,0,2.1276595744680851,2.1208907741251326,0,2.5284450063211126,1.8404907975460123,1.2217470983506415,0.92821782178217815,0.62208398133748055,0.93896713615023475,1.2239902080783354,0.91659028414298815,0.61785603954278656,0.64432989690721654,0.65832784726793936,1.0266940451745381,1.38217000691085,1.4084507042253522,2.0503261882572228,0.74404761904761896,1.2192643771591138,1.0369141435089175]
["I21","Taxa de Mortalidade Pós-Neonatal","A904","R06","ALTO ALENTEJO","ULS Norte Alentejano","I21R06",0,0.90252707581227443,1.86046511627907,2.5996533795493937,0.87183958151700092,0,0.95057034220532322,0.9852216748768472,0,2.0020020020020022,1.1750881316098707,2.4937655860349128,2.2321428571428572,1.1376564277588168,0,1.1402508551881414,0.92621179376350715,1.7980221756068324,1.777251184834123,1.199040767386091,0.6184291898577613,0.64474532559638942,0.65659881812212728,1.0023387905111927,1.0604453870625663,1.8853695324283559,1.9615535504119261,1.9402405898331394,1.1156563778356265,0.74906367041198507,1.2635379061371841,0.78740157480314954,1.3818516812528789,1.3736263736263736]
["I21","Taxa de Mortalidade Pós-Neonatal","A905","R07","BAIXO ALENTEJO","ULS Baixo Alentejo","I21R07",1.8050541516245489,0,1.5936254980079683,0,4.8543689320388346,1.784121320249777,0,1.6977928692699491,0.84602368866328259,0.8347245409015025,1.9212295869356388,1.8331805682859763,5.6338028169014089,1.8814675446848543,1.8399264029438822,0,1.1289867344058708,0.56006720806496779,2.2056796250344637,2.2902948754652162,2.2720817949446181,1.155067860236789,0.85130533484676496,1.1242270938729624,1.1692487576731949,1.5015015015015014,3.1279324366593682,3.1065548306927617,3.1104199066874028,1.2634238787113075,1.6906170752324599,1.0268697586856066,2.6182906302599589,2.254791431792559]
["I26","Nados Vivos + Fetos Mortos 28+s","CT","R01","CONTINENTE","Continente","I26R01",104155,106733,107273,109778,113741,106833,108555,106548,103576,103703,100019,97192,99305,94594,96362,91909,318161,323784,330792,330352,329129,321936,318679,313827,307298,300914,296516,291091,290261,282865,541680,529215,487472,479362]
["I26","Nados Vivos + Fetos Mortos 28+s","RA","R02","REGIÃO ALENTEJO","Região Alentejo","I26R02",4411,4696,4663,4718,4808,4445,4567,4615,4595,4501,4115,4020,4199,4053,4162,4098,13770,14077,14189,13971,13820,13627,13777,13711,13211,12636,12334,12272,12414,12313,23296,22723,20549,20532]
["I26","Nados Vivos + Fetos Mortos 28+s","A401","R03","ALENTEJO LITORAL","ACES Alentejo Litoral","I26R03",746,782,780,835,807,788,800,835,864,827,752,753,816,793,826,835,2308,2397,2422,2430,2395,2423,2499,2526,2443,2332,2321,2362,2435,2454,3950,4114,3940,4023]
["I26","Nados Vivos + Fetos Mortos 28+s","A402","R04","ALENTEJO CENTRAL I","ACES Alentejo Central I","I26R04",495,509,473,483,481,452,460,482,456,391,407,386,401,370,378,408,1477,1465,1437,1416,1393,1394,1398,1329,1254,1184,1194,1157,1149,1156,2441,2241,1942,1943]
["I26","Nados Vivos + Fetos Mortos 28+s","A403","R05","ALENTEJO CENTRAL II","ACES Alentejo Central II","I26R05",995,1101,1076,1097,1120,1039,1079,1093,1110,1078,1059,976,1014,942,946,961,3172,3274,3293,3256,3238,3211,3282,3281,3247,3113,3049,2932,2902,2849,5389,5399,4937,4839]
["I26","Nados Vivos + Fetos Mortos 28+s","A904","R06","ALTO ALENTEJO","ULS Norte Alentejano","I26R06",1061,1118,1077,1164,1157,1039,1057,1019,980,1001,852,807,902,883,918,877,3256,3359,3398,3360,3253,3115,3056,3000,2833,2660,2561,2592,2703,2678,5577,5096,4362,4387]
["I26","Nados Vivos + Fetos Mortos 28+s","A905","R07","BAIXO ALENTEJO","ULS Baixo Alentejo","I26R07",1114,1186,1257,1139,1243,1127,1171,1186,1185,1204,1045,1098,1066,1065,1094,1017,3557,3582,3639,3509,3541,3484,3542,3575,3434,3347,3209,3229,3225,3176,5939,5873,5368,5340]
["I22","Fetos Mortos de 28 ou mais semanas","CT","R01","CONTINENTE","Continente","I22R01",487,434,416,397,423,354,363,316,267,283,306,267,248,270,229,209,1337,1247,1236,1174,1140,1033,946,866,856,856,821,785,747,708,2157,1583,1320,1223]
["I22","Fetos Mortos de 28 ou mais semanas","RA","R02","REGIÃO ALENTEJO","Região Alentejo","I22R02",18,23,10,30,30,22,24,18,13,21,13,21,11,15,17,8,51,63,70,82,76,64,55,52,47,55,45,47,43,40,111,98,77,72]
["I22","Fetos Mortos de 28 ou mais semanas","A401","R03","ALENTEJO LITORAL","ACES Alentejo Litoral","I22R03",3,2,2,5,4,3,5,2,2,6,4,3,1,4,2,2,7,9,11,12,12,10,9,10,12,13,8,8,7,8,16,18,14,12]
["I22","Fetos Mortos de 28 ou mais semanas","A402","R04","ALENTEJO CENTRAL I","ACES Alentejo Central I","I22R04",2,2,1,4,1,1,0,3,1,6,1,1,0,3,1,1,5,7,6,6,2,4,4,10,8,8,2,4,4,5,10,11,6,6]
["I22","Fetos Mortos de 28 ou mais semanas","A403","R05","ALENTEJO CENTRAL II","ACES Alentejo Central II","I22R05",2,3,3,8,8,8,7,1,6,1,3,5,3,2,3,4,8,14,19,24,23,16,14,8,10,9,11,10,8,9,24,23,16,17]
["I22","Fetos Mortos de 28 ou mais semanas","A904","R06","ALTO ALENTEJO","ULS Norte Alentejano","I22R06",5,10,2,10,10,4,5,4,1,2,1,5,6,4,4,0,17,22,22,24,19,13,10,7,4,8,12,15,14,8,37,16,20,19]
["I22","Fetos Mortos de 28 ou mais semanas","A905","R07","BAIXO ALENTEJO","ULS Baixo Alentejo","I22R07",6,6,2,3,7,6,7,8,3,6,4,7,1,2,7,1,14,11,12,16,20,21,18,17,13,17,12,10,10,10,24,30,21,18]
["I23","Taxa de Mortalidade Fetal Tardia","CT","R01","CONTINENTE","Continente","I23R01",4.6757236810522773,4.0662213186174849,3.8779562424841294,3.6163894405072057,3.7189755672976323,3.3135828816938586,3.3439270415918196,2.965799451890228,2.5778172549625396,2.7289470892838201,3.0594187104450152,2.7471396822783771,2.4973566285685513,2.8543036556229779,2.376455449243478,2.2739884015711196,0.42022749488466526,0.38513329874237145,0.37364869767104403,0.3553785053518671,0.34636874903153475,0.32087122906416182,0.29685043570489428,0.27594821350616744,0.27855697075802643,0.28446665824787148,0.27688219185473972,0.26967511877728956,0.25735458776756093,0.25029607763420714,3.9820558263181214,2.9912228489366326,2.7078478353628515,2.5513077799241493]
["I23","Taxa de Mortalidade Fetal Tardia","RA","R02","REGIÃO ALENTEJO","Região Alentejo","I23R02",4.080707322602585,4.8977853492333905,2.1445421402530558,6.3586265366680799,6.2396006655574041,4.9493813273340832,5.2550908692796146,3.9003250270855903,2.8291621327529923,4.665629860031105,3.1591737545565004,5.2238805970149258,2.619671350321505,3.7009622501850479,4.0845747236905332,1.9521717911176184,0.37037037037037041,0.44753853804077576,0.49333991119881598,0.58693006942953263,0.54992764109985526,0.46965583033683134,0.39921608477897946,0.37925753045000365,0.35576413594731665,0.43526432415321298,0.36484514350575648,0.3829856584093872,0.3463831158369583,0.32485990416632826,4.7647664835164836,4.3128108084319852,3.7471409800963551,3.5067212156633549]
["I23","Taxa de Mortalidade Fetal Tardia","A401","R03","ALENTEJO LITORAL","ACES Alentejo Litoral","I23R03",4.0214477211796247,2.5575447570332481,2.5641025641025643,5.9880239520958085,4.9566294919454768,3.8071065989847717,6.25,2.3952095808383231,2.3148148148148149,7.255139056831923,5.3191489361702127,3.9840637450199203,1.2254901960784315,5.0441361916771754,2.4213075060532687,2.3952095808383231,0.30329289428076256,0.37546933667083854,0.45417010734929814,0.49382716049382713,0.5010438413361169,0.41271151465125877,0.36014405762304924,0.39588281868566899,0.49119934506753987,0.55746140651801035,0.34467901766479964,0.33869602032176122,0.28747433264887062,0.32599837000814996,4.0506329113924053,4.3753038405444826,3.5532994923857868,2.9828486204325126]
["I23","Taxa de Mortalidade Fetal Tardia","A402","R04","ALENTEJO CENTRAL I","ACES Alentejo Central I","I23R04",4.0404040404040407,3.9292730844793708,2.1141649048625792,8.2815734989648035,2.0790020790020791,2.2123893805309733,0,6.224066390041493,2.1929824561403506,15.34526854219949,2.4570024570024569,2.5906735751295336,0,8.1081081081081088,2.6455026455026456,2.4509803921568629,0.33852403520649971,0.47781569965870302,0.41753653444676403,0.42372881355932202,0.14357501794687724,0.28694404591104739,0.28612303290414876,0.7524454477050414,0.63795853269537484,0.67567567567567566,0.16750418760469013,0.34572169403630076,0.34812880765883375,0.43252595155709345,4.0966816878328558,4.9085229808121378,3.0895983522142121,3.0880082346886257]
["I23","Taxa de Mortalidade Fetal Tardia","A403","R05","ALENTEJO CENTRAL II","ACES Alentejo Central II","I23R05",2.0100502512562817,2.7247956403269753,2.7881040892193307,7.2926162260711029,7.1428571428571423,7.6997112608277192,6.487488415199258,0.91491308325709064,5.4054054054054053,0.92764378478664189,2.8328611898017,5.1229508196721305,2.9585798816568047,2.1231422505307855,3.1712473572938689,4.1623309053069724,0.25220680958385877,0.42761148442272445,0.5769814758578804,0.73710073710073709,0.71031500926497837,0.49828713796325136,0.42656916514320536,0.24382810118866197,0.30797659377887282,0.28911018310311598,0.36077402427025257,0.34106412005457026,0.2756719503790489,0.31590031590031586,4.4535164223418073,4.2600481570661239,3.2408345148875837,3.5131225459805746]
["I23","Taxa de Mortalidade Fetal Tardia","A904","R06","ALTO ALENTEJO","ULS Norte Alentejano","I23R06",4.7125353440150795,8.9445438282647576,1.8570102135561746,8.5910652920962214,8.6430423509075194,3.8498556304138596,4.7303689687795645,3.9254170755642783,1.0204081632653061,1.9980019980019981,1.1737089201877935,6.195786864931847,6.6518847006651889,4.5300113250283127,4.3572984749455346,0,0.52211302211302213,0.65495683239059244,0.64743967039434958,0.7142857142857143,0.58407623731939751,0.4173354735152488,0.32722513089005234,0.23333333333333336,0.14119308153900459,0.30075187969924816,0.46856696602889492,0.57870370370370372,0.51794302626711053,0.2987303958177745,6.6343912497758648,3.1397174254317113,4.5850527281063727,4.3309778892181443]
["I23","Taxa de Mortalidade Fetal Tardia","A905","R07","BAIXO ALENTEJO","ULS Baixo Alentejo","I23R07",5.3859964093357275,5.0590219224283306,1.5910898965791569,2.6338893766461808,5.6315366049879323,5.3238686779059448,5.977796754910333,6.7453625632377738,2.5316455696202533,4.9833887043189362,3.8277511961722488,6.3752276867030968,0.93808630393996251,1.8779342723004695,6.3985374771480803,0.98328416912487715,0.3935901040202418,0.30709101060859856,0.32976092333058532,0.45597036192647478,0.56481219994351883,0.6027554535017221,0.50818746470920384,0.47552447552447552,0.37856726849155503,0.50791753809381535,0.373948270489249,0.30969340353050478,0.31007751937984496,0.31486146095717887,4.0410843576359659,5.1081219138430098,3.9120715350223549,3.3707865168539328]
["I24","Óbitos Perinatais","CT","R01","CONTINENTE","Continente","I24R01",804,725,709,677,700,573,637,532,439,443,460,419,394,421,337,345,2238,2111,2086,1950,1910,1742,1608,1414,1342,1322,1273,1234,1152,1103,3615,2624,2031,1916]
["I24","Óbitos Perinatais","RA","R02","REGIÃO ALENTEJO","Região Alentejo","I24R02",26,31,19,38,39,31,34,30,28,30,21,28,19,27,21,14,76,88,96,108,104,95,92,88,79,79,68,74,67,62,153,153,116,109]
["I24","Óbitos Perinatais","A401","R03","ALENTEJO LITORAL","ACES Alentejo Litoral","I24R03",5,3,4,6,4,7,8,5,4,8,6,4,3,7,2,3,12,13,14,17,19,20,17,17,18,18,13,14,12,12,22,32,22,19]
["I24","Óbitos Perinatais","A402","R04","ALENTEJO CENTRAL I","ACES Alentejo Central I","I24R04",3,5,3,6,1,1,1,3,2,8,1,2,0,3,3,1,11,14,10,8,3,5,6,13,11,11,3,5,6,7,18,15,9,9]
["I24","Óbitos Perinatais","A403","R05","ALENTEJO CENTRAL II","ACES Alentejo Central II","I24R05",3,5,3,9,10,10,8,5,11,2,4,7,4,4,3,5,11,17,22,29,28,23,24,18,17,13,15,15,11,12,30,36,22,23]
["I24","Óbitos Perinatais","A904","R06","ALTO ALENTEJO","ULS Norte Alentejano","I24R06",6,10,5,12,13,6,7,6,3,5,3,8,9,6,4,1,21,27,30,31,26,19,16,14,11,16,20,23,19,11,46,27,30,28]
["I24","Óbitos Perinatais","A905","R07","BAIXO ALENTEJO","ULS Baixo Alentejo","I24R07",9,8,4,5,11,7,10,11,8,7,7,7,3,7,9,4,21,17,20,23,28,28,29,26,22,21,17,17,19,20,37,43,33,30]
["I25","Taxa de Mortalidade Perinatal","CT","R01","CONTINENTE","Continente","I25R01",7.7192645576304546,6.7926508202711444,6.6093052305799223,6.1669915647944036,6.1543330900906446,5.3635112746061608,5.867993183179034,4.9930547734354471,4.2384336139646246,4.2718147015997605,4.5991261660284541,4.3110544077701869,3.9675746437742307,4.450599403767681,3.4972291982316683,3.7537129116843837,7.0341745217044203,6.5197786178439951,6.3060775351278151,5.9027945948563953,5.8031957074581699,5.4110133691168434,5.0458298162100421,4.5056671350776067,4.3670964340802731,4.3932818014449309,4.2931915984297637,4.2392241601423608,3.968841835451542,3.8993866331995828,6.6736818785999112,4.9582872745481508,4.1663931466832969,3.996979318343965]
["I25","Taxa de Mortalidade Perinatal","RA","R02","REGIÃO ALENTEJO","Região Alentejo","I25R02",5.8943550215370673,6.6013628620102214,4.0746300664808066,8.0542602797795677,8.1114808652246246,6.9741282339707542,7.4447120648127871,6.5005417118093174,6.093579978237214,6.6651855143301484,5.1032806804374244,6.9651741293532341,4.5248868778280551,6.6617320503330868,5.045651129264777,3.4163006344558324,5.5192447349310099,6.2513319599346451,6.7658044964409054,7.7302984754133561,7.5253256150506509,6.9714537315623391,6.67779632721202,6.4182043614616004,5.9798652637953227,6.2519784742006959,5.5132155018647646,6.0299869621903515,5.3971322700177211,5.0353285145780884,6.5676510989010985,6.7332658539805479,5.6450435544308721,5.3087862848236904]
["I25","Taxa de Mortalidade Perinatal","A401","R03","ALENTEJO LITORAL","ACES Alentejo Litoral","I25R03",6.7024128686327078,3.8363171355498724,5.1282051282051286,7.1856287425149699,4.9566294919454768,8.8832487309644677,10,5.9880239520958085,4.6296296296296298,9.6735187424425622,7.9787234042553186,5.3120849933598935,3.6764705882352939,8.827238335435057,2.4213075060532687,3.5928143712574849,5.1993067590987874,5.423445974134335,5.7803468208092479,6.9958847736625511,7.9331941544885183,8.2542302930251754,6.8027210884353737,6.7300079176563736,7.367990176013099,7.7186963979416809,5.6010340370529947,5.9271803556308216,4.9281314168377826,4.8899755501222497,5.5696202531645573,7.7783179387457455,5.5837563451776644,4.722843649018146]
["I25","Taxa de Mortalidade Perinatal","A402","R04","ALENTEJO CENTRAL I","ACES Alentejo Central I","I25R04",6.0606060606060606,9.8231827111984273,6.3424947145877377,12.422360248447204,2.0790020790020791,2.2123893805309733,2.1739130434782608,6.224066390041493,4.3859649122807012,20.460358056265985,2.4570024570024569,5.1813471502590671,0,8.1081081081081088,7.9365079365079358,2.4509803921568629,7.4475287745429926,9.5563139931740615,6.9589422407794013,5.6497175141242941,2.1536252692031588,3.5868005738880919,4.2918454935622314,9.7817908201655381,8.7719298245614024,9.2905405405405403,2.512562814070352,4.3215211754537597,5.2219321148825069,6.0553633217993079,7.3740270380991397,6.6934404283801872,4.6343975283213181,4.6320123520329393]
["I25","Taxa de Mortalidade Perinatal","A403","R05","ALENTEJO CENTRAL II","ACES Alentejo Central II","I25R05",3.0150753768844218,4.5413260672116262,2.7881040892193307,8.2041932543299918,8.9285714285714288,9.624639076034649,7.4142724745134387,4.574565416285453,9.9099099099099099,1.8552875695732838,3.7771482530689333,7.1721311475409841,3.9447731755424065,4.2462845010615711,3.1712473572938689,5.2029136316337148,3.4678436317780581,5.1924251679902262,6.6808381415122993,8.9066339066339069,8.647313156269302,7.1628776082217378,7.3126142595978063,5.486132276744895,5.2356020942408383,4.1760359781561194,4.9196457855034437,5.1159618008185541,3.790489317711923,4.2120042120042118,5.5668955279272589,6.6679014632339326,4.4561474579704274,4.7530481504443065]
["I25","Taxa de Mortalidade Perinatal","A904","R06","ALTO ALENTEJO","ULS Norte Alentejano","I25R06",5.6550424128180961,8.9445438282647576,4.6425255338904359,10.309278350515465,11.235955056179774,5.7747834456207885,6.6225165562913908,5.8881256133464177,3.0612244897959182,4.9950049950049946,3.5211267605633805,9.9132589838909535,9.9778270509977816,6.7950169875424686,4.3572984749455346,1.1402508551881414,6.4496314496314495,8.0381065793390878,8.8287227781047672,9.2261904761904763,7.9926221948970184,6.0995184590690208,5.2356020942408383,4.666666666666667,3.882809742322626,6.015037593984963,7.8094494338149154,8.8734567901234556,7.0292267850536438,4.1075429424943986,8.2481620943159406,5.2982731554160125,6.8775790921595599,6.3824937314793706]
["I25","Taxa de Mortalidade Perinatal","A905","R07","BAIXO ALENTEJO","ULS Baixo Alentejo","I25R07",8.0789946140035909,6.7453625632377738,3.1821797931583138,4.3898156277436353,8.8495575221238933,6.2111801242236018,8.5397096498719041,9.2748735244519391,6.7510548523206753,5.8139534883720927,6.6985645933014357,6.3752276867030968,2.8142589118198873,6.572769953051643,8.2266910420475323,3.9331366764995086,5.9038515603036261,4.7459519821328859,5.4960153888430892,6.5545739526930751,7.9073707992092634,8.0367393800229614,8.1874647092038408,7.2727272727272725,6.4065230052417004,6.27427547057066,5.2976004985976939,5.2647878600185818,5.8914728682170541,6.2972292191435768,6.2300050513554472,7.3216414098416482,6.1475409836065573,5.6179775280898872]

{"sheet":"Id","index":3,"n_rows":127,"n_cols":15,"rows_kept":127,"cut":false,"hidden":true,"merged":[]}
["Lista de Variáveis"]
[]
[null,null,null,null,null,"Consulta de Dados por Indicador ou por Local de Residência",1,null,null,"Cod_IndRes"]
[null,null,null,null,null,null,null,null,null,{"$f":"CONCATENATE(J9,J40)","v":"I25R01"},10]
[]
[null,"n1","n2","n3","cod_Ind","Indicador","Ind_Abrev","Anual","ContarInd","Id_Indicador"]
[null,1,null,null,null,"----- Selecionar -----",null,null,{"$f":"COUNTIF(H8:H34,\"VERDADEIRO\")","v":0},25]
[null,2,0,"I01","NB01","Nados Vivos","Nados Vivos",false,null,{"$f":"INDEX(Indicadores,Id_Indicador)","v":"Taxa de Mortalidade Perinatal"}]
[null,3,1,"I02","NT01","Taxa Bruta de Natalidade","Taxa Bruta de Natalidade",false,null,{"$f":"INDEX(cod_I,Id_Indicador)","v":"I25"}]
[null,null,0,"I03","NB02","Nascimentos em Mulheres com Idade Inferior a 20 anos","Nasc. Mulheres < 20 anos",false,null,{"$f":"INDEX(NumForm,Id_Indicador)","v":1}]
[null,null,1,"I04","NT02","Proporção de Nascimentos em Mulheres com Idade Inferior a 20 anos","Proporção Nasc. Mulheres < 20 anos",false,null,{"$f":"INDEX(Indicadores_Abrev,Id_Indicador)","v":"Taxa de Mortalidade Perinatal"}]
[null,null,0,"I05","NB03","Nascimentos em Mulheres com Idade igual ou superior a 35 anos","Nasc. Mulheres ≥35 anos",false]
[null,null,1,"I06","NT03","Proporção de Nascimentos em Mulheres com Idade igual ou superior a 35 anos","Proporção Nasc. Mulheres ≥35 anos",false]
[null,null,0,"I07","NB04","Nascimentos Pré-termo","Nascimentos Pré-termo",false]
[null,null,1,"I08","NT04","Proporção de Nascimentos Pré-termo","Proporção de Nascimentos Pré-termo",false]
[null,null,0,"I09","NB05","Crianças com Baixo Peso à Nascença","Baixo Peso à Nascença",false]
[null,null,1,"I10","NT05","Proporção de Crianças com Baixo Peso à Nascença","Proporção de Baixo Peso à Nascença",false]
[null,null,2,"I11","NT06","Índice Sintético de Fecundidade (ISF)","Índice Sintético de Fecundidade (ISF)",false]
[null,null,0,"I12","MB01","Óbitos","Óbitos",false]
[null,null,1,"I13","MT01","Taxa Bruta de Mortalidade","Taxa Bruta de Mortalidade",false]
[null,null,0,"I14","MB02","Óbitos Infantis","Óbitos Infantis",false]
[null,null,1,"I15","MT02","Taxa de Mortalidade Infantil","Taxa de Mortalidade Infantil",false]
[null,null,0,"I16","MB03","Óbitos Neonatais","Óbitos Neonatais",false]
[null,null,1,"I17","MT03","Taxa de Mortalidade Neonatal","Taxa de Mortalidade Neonatal",false]
[null,null,0,"I18","MB04","Óbitos Neonatais Precoces","Óbitos Neonatais Precoces",false]
[null,null,1,"I19","MT04","Taxa de Mortalidade Neonatal Precoce","Taxa de Mortalidade Neonatal Precoce",false]
[null,null,0,"I20","MB05","Óbitos Pós-Neonatais","Óbitos Pós-Neonatais",false]
[null,null,1,"I21","MT05","Taxa de Mortalidade Pós-Neonatal","Taxa de Mortalidade Pós-Neonatal",false]
[null,null,0,"I22","MB06","Fetos Mortos de 28 ou mais semanas","Fetos Mortos de 28 ou mais semanas",false]
[null,null,1,"I23","MT06","Taxa de Mortalidade Fetal Tardia","Taxa de Mortalidade Fetal Tardia",false]
[null,null,0,"I24","MB07","Óbitos Perinatais","Óbitos Perinatais",false]
[null,null,1,"I25","MT07","Taxa de Mortalidade Perinatal","Taxa de Mortalidade Perinatal",false]
[null,null,0,"I26","NM01","Nados Vivos + Fetos Mortos 28+s","Nados Vivos + Fetos Mortos 28+s"]
[null,null,1,"I27","PB01","População Média","População Média"]
[null,null,null,null,null,"Todos",null,false]
[]
[null,"n1","n2","n3","cod_LR","Local_Residencia","Res_Abrev","Anual","ContarRes","Id_Residencia"]
[null,null,null,null,null,"----- Selecionar -----",null,null,{"$f":"COUNTIF(H39:H45,\"VERDADEIRO\")","v":0},1]
[null,null,null,"R01","CT","Continente","CT",false,null,{"$f":"INDEX(Residencia,Id_Residencia)","v":"Continente"}]
[null,null,null,"R02","RA","Região de Saúde do Alentejo","RA",false,null,{"$f":"INDEX(cod_R,Id_Residencia)","v":"R01"}]
[null,null,null,"R03","A401","ACES Alentejo Litoral","A401",false]
[null,null,null,"R04","A402","ACES Alentejo Central I","A402",false]
[null,null,null,"R05","A403","ACES Alentejo Central II","A403",false]
[null,null,null,"R06","A904","ULS Norte Alentejano","A904",false]
[null,null,null,"R07","A905","ULS Baixo Alentejo","A905",false]
[null,null,null,null,null,"Todos",null,false]
[]
[null,"n1","n2","n3","cod_Ano","Ano","Ano_Abrev",null,"ContarAno","Id_Ano",null,"Identificar Colunas (ANO)",null,"Colunas a Formatar"]
[null,1,null,null,null,"----- Selecionar -----",null,null,{"$f":"COUNTIF(H50:H65,\"VERDADEIRO\")","v":0},9,null,1,{"$f":"INDEX(ncol,Id_col)","v":"C"},{"$f":"ContarAno+1","v":1},{"$f":"INDEX(ncol,N49)","v":"C"}]
[null,2,1,"A01","A96",1996,96,false,null,{"$f":"INDEX(Ano,Id_Ano)","v":2004},null,"C"]
[null,3,2,"A02","A97",1997,97,false,null,{"$f":"INDEX(cod_A,Id_Ano)","v":"A09"},null,"D"]
[null,4,3,"A03","A98",1998,98,false,null,null,null,"E"]
[null,5,4,"A04","A99",1999,99,false,null,null,null,"F"]
[null,6,5,"A05","A00",2000,"00",false,null,null,null,"G"]
[null,7,6,"A06","A01",2001,"01",false,null,null,null,"H"]
[null,8,7,"A07","A02",2002,"02",false,null,null,null,"I"]
[null,9,8,"A08","A03",2003,"03",false,null,null,null,"J"]
[null,10,9,"A09","A04",2004,"04",false,null,null,null,"K"]
[null,11,10,"A10","A05",2005,"05",false,null,null,null,"L"]
[null,12,11,"A11","A06",2006,"06",false,null,null,null,"M"]
[null,13,12,"A12","A07",2007,"07",false,null,null,null,"N"]
[null,14,13,"A13","A08",2008,"08",false,null,null,null,"O"]
[null,15,14,"A14","A09",2009,"09",false,null,null,null,"P"]
[null,16,15,"A15","A10",2010,"10",false,null,null,null,"Q"]
[null,17,16,"A16","A11",2011,"11",false,null,null,null,"R"]
[null,null,null,null,null,"Todos",null,false]
[]
[null,"n1","n2","n3","cod_Tri","Triénio","Tri_Abrev"]
[null,null,1,null,null,"----- Selecionar -----"]
[null,null,2,1,"T01","1996-1998","96-98"]
[null,null,3,2,"T02","1997-1999","97-99"]
[null,null,4,3,"T03","1998-2000","98-00"]
[null,null,5,4,"T04","1999-2001","99-01"]
[null,null,6,5,"T05","2000-2002","00-02"]
[null,null,7,6,"T06","2001-2003","01-03"]
[null,null,8,7,"T07","2002-2004","02-04"]
[null,null,9,8,"T08","2003-2005","03-05"]
[null,null,10,9,"T09","2004-2006","04-06"]
[null,null,11,10,"T10","2005-2007","05-07"]
[null,null,12,11,"T11","2006-2008","06-08"]
[null,null,13,12,"T12","2007-2009","07-09"]
[null,null,14,13,"T13","2008-2010","08-10"]
[null,null,15,14,"T14","2009-2011","09-11"]
[]
[null,"n1","n2","n3","cod_Qui","Quinquénio","Qui_Abrev"]
[null,null,null,null,null,"----- Selecionar -----"]
[null,null,null,1,"Q01","1996-2000","96-00"]
[null,null,null,2,"Q02","2001-2005","01-05"]
[null,null,null,3,"Q03","2006-2010","06-10"]
[null,null,null,4,"Q04","2007-2011","07-11"]
[]
[null,"n1","n2","n3","cod_LR","ACeS_Select"]
[null,null,null,1,null,"----- Selecionar -----"]
[null,null,null,2,"R03","ACES Alentejo Litoral"]
[null,null,null,3,"R04","ACES Alentejo Central I"]
[null,null,null,4,"R05","ACES Alentejo Central II"]
[null,null,null,5,"R06","ULS Norte Alentejano"]
[null,null,null,6,"R07","ULS Baixo Alentejo"]
[]
[null,"n1","n2","n3","cod_Ind","Indicador_Select"]
[null,null,1,null,null,"----- Selecionar -----"]
[null,null,2,"A","I02","Taxa Bruta de Natalidade (Anual)","TAXA BRUTA DE NATALIDADE","(/1000 HABITANTES)","(ANUAL)"]
[null,null,3,"T","I04","Proporção de Nascimentos em Mulheres com Idade Inferior a 20 anos","PROPORÇÃO DE NASCIMENTOS EM MULHERES COM IDADE INFERIOR A 20 ANOS","(%)","(MÉDIA ANUAL POR TRIÉNIOS)"]
[null,null,4,"T","I06","Proporção de Nascimentos em Mulheres com Idade igual ou superior a 35 anos","PROPORÇÃO DE NASCIMENTOS EM MULHERES COM IDADE IGUAL OU SUPERIOR A 35 ANOS","(%)","(MÉDIA ANUAL POR TRIÉNIOS)"]
[null,null,5,"T","I08","Proporção de Nascimentos Pré-termo","PROPORÇÃO DE NASCIMENTOS PRÉ-TERMO","(%)","(MÉDIA ANUAL POR TRIÉNIOS)"]
[null,null,6,"T","I10","Proporção de Crianças com Baixo Peso à Nascença","PROPORÇÃO DE CRIANÇAS COM BAIXO PESO À NASCENÇA","(%)","(MÉDIA ANUAL POR TRIÉNIOS)"]
[null,null,7,"A","I11","Índice Sintético de Fecundidade, ISF (Anual)","ÍNDICE SINTÉTICO DE FECUNDIDADE","(ISF)","(ANUAL)"]
[null,null,8,"A","I13","Taxa Bruta de Mortalidade (Anual)","TAXA BRUTA DE MORTALIDADE","(/1000 HABITANTES)","(ANUAL)"]
[null,null,9,"T","I15","Taxa de Mortalidade Infantil","TAXA DE MORTALIDADE INFANTIL","(/1000 NADOS VIVOS)","(MÉDIA ANUAL POR TRIÉNIOS)"]
[null,null,10,"T","I17","Taxa de Mortalidade Neonatal","TAXA DE MORTALIDADE NEONATAL","(/1000 NADOS VIVOS)","(MÉDIA ANUAL POR TRIÉNIOS)"]
[null,null,11,"T","I19","Taxa de Mortalidade Neonatal Precoce","TAXA DE MORTALIDADE NEONATAL PRECOCE","(/1000 NADOS VIVOS)","(MÉDIA ANUAL POR TRIÉNIOS)"]
[null,null,12,"T","I21","Taxa de Mortalidade Pós-Neonatal","TAXA DE MORTALIDADE PÓS-NEONATAL","(/1000 NADOS VIVOS)","(MÉDIA ANUAL POR TRIÉNIOS)"]
[null,null,13,"T","I23","Taxa de Mortalidade Fetal Tardia","TAXA DE MORTALIDADE FETAL TARDIA","(/1000 (NADOS VIVOS + FETOS MORTOS DE 28 OU MAIS SEMANAS))","(MÉDIA ANUAL POR TRIÉNIOS)"]
[null,null,14,"T","I25","Taxa de Mortalidade Perinatal","TAXA DE MORTALIDADE PERINATAL","(/1000 (NADOS VIVOS + FETOS MORTOS DE 28 OU MAIS SEMANAS))","(MÉDIA ANUAL POR TRIÉNIOS)"]
[]
[null,"n1","n2","n3","cod_Ind","RazaoR_Indicador"]
[null,null,null,1,null,"----- Selecionar -----"]
[null,null,null,2,"I03","Nascimentos em Mulheres com Idade Inferior a 20 anos","NASCIMENTOS EM MULHERES COM IDADE INFERIOR A 20 ANOS"]
[null,null,null,3,"I05","Nascimentos em Mulheres com Idade igual ou superior a 35 anos","NASCIMENTOS EM MULHERES COM IDADE IGUAL OU SUPERIOR A 35 ANOS"]
[null,null,null,4,"I07","Nascimentos Pré-termo","NASCIMENTOS PRÉ-TERMO"]
[null,null,null,5,"I09","Crianças com Baixo Peso à Nascença","CRIANÇAS COM BAIXO PESO À NASCENÇA"]
[null,null,null,6,"I14","Óbitos Infantis","ÓBITOS INFANTIS"]
[null,null,null,7,"I16","Óbitos Neonatais","ÓBITOS NEONATAIS"]
[null,null,null,8,"I18","Óbitos Neonatais Precoces","ÓBITOS NEONATAIS PRECOCES"]
[null,null,null,9,"I20","Óbitos Pós-Neonatais","ÓBITOS PÓS-NEONATAIS"]
[null,null,null,10,"I22","Fetos Mortos de 28 ou mais semanas","FETOS MORTOS DE 28 OU MAIS SEMANAS"]
[null,null,null,11,"I24","Óbitos Perinatais","ÓBITOS PERINATAIS"]

{"sheet":"ConsAnual","index":4,"n_rows":12,"n_cols":6,"rows_kept":12,"cut":false,"hidden":false,"merged":[[1,1,1,5],[3,1,3,5],[6,1,6,5],[17,1,17,5]]}
[]
[null,"mort@lidades.infantil"]
[]
[null,"Consulta de Indicadores (Anual)"]
[]
[]
[null,"Selecione Indicador, Local de Residência e Ano. Gere os dados por Indicador ou por Local de Residência."]
[]
[null,"INDICADOR",null,"LOCAL DE RESIDÊNCIA",null,"ANO"]
[null,"Natalidade"]
[]
[null,"Mortalidade"]

{"sheet":"DadosAnual","index":5,"n_rows":4,"n_cols":2,"rows_kept":4,"cut":false,"hidden":false,"merged":[[0,1,0,17],[1,1,1,17],[3,1,3,17]]}
[]
[null,"mort@lidades.infantil"]
[]
[null,"Consulta de Indicadores (Anual)"]

{"sheet":"DefInd","index":6,"n_rows":39,"n_cols":3,"rows_kept":39,"cut":false,"hidden":false,"merged":[[0,1,0,2],[1,1,1,2],[3,1,3,2],[19,1,20,1],[40,1,40,2]]}
[]
[null,"mort@lidades.infantil"]
[]
[null,"Indicadores"]
[]
[]
[null,"INDICADORES DE NATALIDADE"]
[]
[null,"INDICADOR","DEFINIÇÃO"]
[null,"Nados vivos","Número de crianças nascidas vivas."]
[null,"Taxa bruta de natalidade","Número de nados vivos ocorrido durante um determinado período de tempo, normalmente um ano civil, referido à população média desse período (expressa em número de nados vivos por 1000 habitantes)."]
[null,"Nascimentos em mulheres com idade inferior a 20 anos","Número de nados vivos em mulheres com idade inferior a 20 anos."]
[null,"Proporção (%) de nascimentos em mulheres com idade inferior a 20 anos","Número de nados vivos em mulheres com idade inferior a 20 anos, durante um determinado período de tempo, referido ao número total de nados vivos."]
[null,"Nascimentos em mulheres com idade igual ou superior a 35 anos","Número de nados vivos em mulheres com idade igual ou superior a 35 anos."]
[null,"Proporção (%) de nascimentos em mulheres com idade igual ou superior a 35 anos","Número de nados vivos em mulheres com idade igual ou superior a 35 anos, durante um determinado período de tempo, referido ao número total de nados vivos do mesmo período."]
[null,"Nascimentos pré-termo","Número de nados vivos com menos de 37 semanas de gestação."]
[null,"Proporção (%) de nascimentos pré-termo","Número de nados vivos com menos de 37 semanas de gestação, durante um determinado período de tempo, referido ao número total de nados vivos do mesmo período."]
[null,"Crianças com baixo peso à nascença","Número de nascimentos de crianças com peso inferior a 2500 gramas."]
[null,"Proporção (%) de crianças com baixo peso à nascença","Número de nascimentos de crianças com peso inferior a 2500 gramas, durante um determinado período de tempo, referido ao número total de nados vivos do mesmo período."]
[null,"Índice sintético de fecundidade (ISF)","Número médio de crianças vivas nascidas por mulher em idade fértil (dos 15 aos 49 anos de idade), admitindo que as mulheres estariam submetidas às taxas de fecundidade observadas no momento. Valor resultante da soma das taxas de fecundidade por idades, ano a ano ou grupos quinquenais, entre os 15 e os 49 anos, observadas num determinado período (habitualmente um ano civil)."]
[null,null,"Nota: O número de 2,1 crianças por mulher é considerado o nível mínimo para assegurar a substituição de gerações, nos países mais desenvolvidos."]
[]
[null,"INDICADORES DE MORTALIDADE"]
[]
[null,"INDICADOR","DEFINIÇÃO"]
[null,"Óbitos","Número de óbitos."]
[null,"Taxa bruta de mortalidade","Número de óbitos observado durante um determinado período de tempo, normalmente um ano civil, referido à população média desse período (expressa em número de óbitos por 1000 habitantes)."]
[null,"Óbitos infantis","Número de óbitos de crianças com menos de 1 ano de idade."]
[null,"Taxa de mortalidade infantil","Número de óbitos de crianças com menos de 1 ano de idade observado durante um determinado período de tempo, referido ao número de nados vivos do mesmo período (habitualmente expressa em número de óbitos de crianças com menos de 1 ano por 1000 nados vivos)."]
[null,"Óbitos neonatais","Número de óbitos de crianças com menos de 28 dias de idade."]
[null,"Taxa de mortalidade neonatal","Número de óbitos de crianças com menos de 28 dias de idade observado durante um determinado período de tempo, referido ao número de nados vivos do mesmo período (expressa em número de óbitos de crianças com menos de 28 dias de idade por 1000 nados vivos)."]
[null,"Óbitos neonatais precoces","Número de óbitos de crianças com menos de 7 dias de idade."]
[null,"Taxa de mortalidade neonatal precoce","Número de óbitos de crianças com menos de 7 dias de idade observado durante um determinado período de tempo, referido ao número de nados vivos do mesmo período (expressa em número de óbitos de crianças com menos de 7 dias de idade por 1000 nados vivos)."]
[null,"Óbitos pós-neonatais","Número de óbitos de crianças com 28 ou mais dias de idade e menos de um ano de idade."]
[null,"Taxa de mortalidade pós-neonatal","Número de óbitos de crianças com 28 ou mais dias de idade e menos de um ano de idade observado durante um determinado período de tempo, referido ao número de nados vivos do mesmo período (expressa em número de óbitos de crianças com mais de 27 dias e menos de um ano de idade por 1000 nados vivos)."]
[null,"Fetos mortos de 28 ou mais semanas","Número de fetos mortos de 28 ou mais semanas."]
[null,"Taxa de mortalidade fetal tardia","Número de fetos mortos de 28 ou mais semanas observado durante um determinado período de tempo, referido ao número de nados vivos e fetos mortos de 28 ou mais semanas do mesmo período (expressa em número de fetos mortos de 28 ou mais semanas por 1000 nados vivos e fetos mortos de 28 ou mais semanas)."]
[null,"Óbitos perinatais","Número de óbitos fetais de 28 ou mais semanas de gestação e óbitos de nados vivos com menos de 7 dias de idade."]
[null,"Taxa de mortalidade perinatal","Número de óbitos fetais de 28 ou mais semanas de gestação e óbitos de nados vivos com menos de 7 dias de idade observado durante um determinado período de tempo, referido ao número de nados vivos e fetos mortos de 28 ou mais semanas do mesmo período (habitualmente expressa em número de óbitos fetais de 28 ou mais semanas e óbitos de nados vivos com menos de 7 dias de idade por 1000 nados vivos e fetos mortos de 28 ou mais semanas)"]

{"sheet":"AnACeS","index":7,"n_rows":153,"n_cols":17,"rows_kept":153,"cut":false,"hidden":false,"merged":[[7,2,7,16],[152,2,152,6],[170,1,170,17],[44,2,44,16],[115,2,115,16],[119,2,119,16],[120,2,120,16],[122,2,122,6],[137,2,137,6],[100,2,100,16],[104,2,104,16],[105,2,105,16],[109,2,109,16],[110,2,110,16],[114,2,114,16],[86,2,86,16],[89,2,89,16],[90,2,90,16],[94,2,94,16],[95,2,95,16],[99,2,99,16],[48,2,48,16],[49,2,49,16],[51,2,51,6],[67,2,67,6],[51,8,51,16],[67,8,67,16],[122,8,122,16],[137,8,137,16],[152,8,152,16],[0,1,0,17],[1,1,1,17],[3,1,3,17],[5,1,5,2],[40,2,40,16],[9,2,9,6],[26,2,26,16],[29,2,29,16],[30,2,30,16],[34,2,34,16],[35,2,35,16],[39,2,39,16],[9,8,9,16]]}
[]
[null,"mort@lidades.infantil"]
[]
[null,"Análise por ACeS"]
[]
[null,"Selecione o ACeS:"]
[]
[null,null,{"$f":"AnACeS_base!D1","v":""}]
[]
[null,null,"TAXA BRUTA DE NATALIDADE (/1000 HABITANTES), 1996-2011 (ANUAL)",null,null,null,null,null,"TAXA BRUTA DE MORTALIDADE (/1000 HABITANTES), 1996-2011 (ANUAL)"]
[]
[]
[]
[]
[]
[]
[]
[]
[]
[]
[]
[]
[]
[]
[]
[]
[null,null,"NATALIDADE"]
[]
[null,null,"Local de residência","96-98","97-99","98-00","99-01","00-02","01-03","02-04","03-05","04-06","05-07","06-08","07-09","08-10","09-11"]
[]
[null,null,"PROPORÇÃO (%) DE NASCIMENTOS EM MULHERES COM IDADE INFERIOR A 20 ANOS"]
[null,null,{"$f":"AnACeS_base!$D$15","v":"Continente"},{"$f":"AnACeS_base!F15","v":6.6005100623690121},{"$f":"AnACeS_base!G15","v":6.3397377665198098},{"$f":"AnACeS_base!H15","v":6.1570719392151858},{"$f":"AnACeS_base!I15","v":5.9997934248339799},{"$f":"AnACeS_base!J15","v":5.8386104412038211},{"$f":"AnACeS_base!K15","v":5.5742701065430982},{"$f":"AnACeS_base!L15","v":5.3239669785637629},{"$f":"AnACeS_base!M15","v":5.0479133182728839},{"$f":"AnACeS_base!N15","v":4.7920976889590854},{"$f":"AnACeS_base!O15","v":4.5957781495577521},{"$f":"AnACeS_base!P15","v":4.3757926241566478},{"$f":"AnACeS_base!Q15","v":4.2810000482249766},{"$f":"AnACeS_base!R15","v":4.0706148925440573},{"$f":"AnACeS_base!S15","v":3.8928681549633715}]
[null,null,{"$f":"AnACeS_base!$D$16","v":"Região de Saúde do Alentejo"},{"$f":"AnACeS_base!F16","v":10.343319483927401},{"$f":"AnACeS_base!G16","v":9.6403596403596392},{"$f":"AnACeS_base!H16","v":9.0233019335646993},{"$f":"AnACeS_base!I16","v":8.841529267765857},{"$f":"AnACeS_base!J16","v":8.6364959254947617},{"$f":"AnACeS_base!K16","v":8.3314900833149004},{"$f":"AnACeS_base!L16","v":7.8632852353884273},{"$f":"AnACeS_base!M16","v":7.2260048319789147},{"$f":"AnACeS_base!N16","v":6.7000911577028255},{"$f":"AnACeS_base!O16","v":6.4223829584293775},{"$f":"AnACeS_base!P16","v":5.9809585808446579},{"$f":"AnACeS_base!Q16","v":5.6441717791411046},{"$f":"AnACeS_base!R16","v":5.343141217363188},{"$f":"AnACeS_base!S16","v":5.3613623400961457}]
[null,null,{"$f":"AnACeS_base!D1","v":""},{"$f":"AnACeS_base!F17","v":""},{"$f":"AnACeS_base!G17","v":""},{"$f":"AnACeS_base!H17","v":""},{"$f":"AnACeS_base!I17","v":""},{"$f":"AnACeS_base!J17","v":""},{"$f":"AnACeS_base!K17","v":""},{"$f":"AnACeS_base!L17","v":""},{"$f":"AnACeS_base!M17","v":""},{"$f":"AnACeS_base!N17","v":""},{"$f":"AnACeS_base!O17","v":""},{"$f":"AnACeS_base!P17","v":""},{"$f":"AnACeS_base!Q17","v":""},{"$f":"AnACeS_base!R17","v":""},{"$f":"AnACeS_base!S17","v":""}]
[]
[null,null,"PROPORÇÃO (%) DE NASCIMENTOS EM MULHERES COM IDADE IGUAL OU SUPERIOR A 35 ANOS"]
[null,null,{"$f":"AnACeS_base!$D$15","v":"Continente"},{"$f":"AnACeS_base!F18","v":11.02852056662374},{"$f":"AnACeS_base!G18","v":11.798646356852082},{"$f":"AnACeS_base!H18","v":12.542026241367173},{"$f":"AnACeS_base!I18","v":13.286124832157679},{"$f":"AnACeS_base!J18","v":13.845586284905897},{"$f":"AnACeS_base!K18","v":14.458886330137144},{"$f":"AnACeS_base!L18","v":15.038412755363781},{"$f":"AnACeS_base!M18","v":15.711222804119362},{"$f":"AnACeS_base!N18","v":16.519276078344351},{"$f":"AnACeS_base!O18","v":17.424297969059317},{"$f":"AnACeS_base!P18","v":18.401393327584167},{"$f":"AnACeS_base!Q18","v":19.432598706192774},{"$f":"AnACeS_base!R18","v":20.605566570183136},{"$f":"AnACeS_base!S18","v":22.210329710055042}]
[null,null,{"$f":"AnACeS_base!$D$16","v":"Região de Saúde do Alentejo"},{"$f":"AnACeS_base!F19","v":9.8039215686274517},{"$f":"AnACeS_base!G19","v":10.468103325246183},{"$f":"AnACeS_base!H19","v":11.43848714498194},{"$f":"AnACeS_base!I19","v":12.369501043991649},{"$f":"AnACeS_base!J19","v":12.645518044237486},{"$f":"AnACeS_base!K19","v":13.013345130133452},{"$f":"AnACeS_base!L19","v":13.489287275907301},{"$f":"AnACeS_base!M19","v":14.276301339775971},{"$f":"AnACeS_base!N19","v":14.896687936797326},{"$f":"AnACeS_base!O19","v":15.332644463874095},{"$f":"AnACeS_base!P19","v":16.429327040442672},{"$f":"AnACeS_base!Q19","v":17.267893660531698},{"$f":"AnACeS_base!R19","v":18.462533344111229},{"$f":"AnACeS_base!S19","v":19.620304733968872}]
[null,null,{"$f":"AnACeS_base!D1","v":""},{"$f":"AnACeS_base!F20","v":""},{"$f":"AnACeS_base!G20","v":""},{"$f":"AnACeS_base!H20","v":""},{"$f":"AnACeS_base!I20","v":""},{"$f":"AnACeS_base!J20","v":""},{"$f":"AnACeS_base!K20","v":""},{"$f":"AnACeS_base!L20","v":""},{"$f":"AnACeS_base!M20","v":""},{"$f":"AnACeS_base!N20","v":""},{"$f":"AnACeS_base!O20","v":""},{"$f":"AnACeS_base!P20","v":""},{"$f":"AnACeS_base!Q20","v":""},{"$f":"AnACeS_base!R20","v":""},{"$f":"AnACeS_base!S20","v":""}]
[]
[null,null,"PROPORÇÃO (%) DE NASCIMENTOS PRÉ-TERMO"]
[null,null,{"$f":"AnACeS_base!$D$15","v":"Continente"},null,null,null,null,{"$f":"AnACeS_base!J21","v":6.027031394345542},{"$f":"AnACeS_base!K21","v":6.3536333409161028},{"$f":"AnACeS_base!L21","v":6.7345853279325727},{"$f":"AnACeS_base!M21","v":6.7775217998408746},{"$f":"AnACeS_base!N21","v":7.1021596256387838},{"$f":"AnACeS_base!O21","v":7.8368182151450725},{"$f":"AnACeS_base!P21","v":8.6653477400700041},{"$f":"AnACeS_base!Q21","v":8.9602006159018419},{"$f":"AnACeS_base!R21","v":8.5187590237432396},{"$f":"AnACeS_base!S21","v":8.0207118731769906}]
[null,null,{"$f":"AnACeS_base!$D$16","v":"Região de Saúde do Alentejo"},null,null,null,null,{"$f":"AnACeS_base!J22","v":6.257275902211874},{"$f":"AnACeS_base!K22","v":6.4366290643662909},{"$f":"AnACeS_base!L22","v":6.7118495846086574},{"$f":"AnACeS_base!M22","v":6.8526246430924669},{"$f":"AnACeS_base!N22","v":7.0723184442418718},{"$f":"AnACeS_base!O22","v":8.1154121294014772},{"$f":"AnACeS_base!P22","v":8.5686386199039788},{"$f":"AnACeS_base!Q22","v":8.8016359918200404},{"$f":"AnACeS_base!R22","v":8.1157545873413639},{"$f":"AnACeS_base!S22","v":7.463537847307097}]
[null,null,{"$f":"AnACeS_base!D1","v":""},null,null,null,null,{"$f":"AnACeS_base!J23","v":""},{"$f":"AnACeS_base!K23","v":""},{"$f":"AnACeS_base!L23","v":""},{"$f":"AnACeS_base!M23","v":""},{"$f":"AnACeS_base!N23","v":""},{"$f":"AnACeS_base!O23","v":""},{"$f":"AnACeS_base!P23","v":""},{"$f":"AnACeS_base!Q23","v":""},{"$f":"AnACeS_base!R23","v":""},{"$f":"AnACeS_base!S23","v":""}]
[null,null,"PROPORÇÃO (%) DE BAIXO PESO À NASCENÇA"]
[null,null,{"$f":"AnACeS_base!$D$15","v":"Continente"},{"$f":"AnACeS_base!F24","v":6.524442592732874},{"$f":"AnACeS_base!G24","v":6.882311176702208},{"$f":"AnACeS_base!H24","v":7.071939215186493},{"$f":"AnACeS_base!I24","v":7.231042171712569},{"$f":"AnACeS_base!J24","v":7.1993268066916878},{"$f":"AnACeS_base!K24","v":7.3056344128911226},{"$f":"AnACeS_base!L24","v":7.4430417992465374},{"$f":"AnACeS_base!M24","v":7.5060470793485452},{"$f":"AnACeS_base!N24","v":7.5629319740766601},{"$f":"AnACeS_base!O24","v":7.6481880169833829},{"$f":"AnACeS_base!P24","v":7.7140296589391104},{"$f":"AnACeS_base!Q24","v":7.9181966614537762},{"$f":"AnACeS_base!R24","v":8.0821652838895535},{"$f":"AnACeS_base!S24","v":8.3258611340494841}]
[null,null,{"$f":"AnACeS_base!$D$16","v":"Região de Saúde do Alentejo"},{"$f":"AnACeS_base!F25","v":6.8372330344777312},{"$f":"AnACeS_base!G25","v":7.3212501783930346},{"$f":"AnACeS_base!H25","v":7.6138536723563996},{"$f":"AnACeS_base!I25","v":7.7687378500971986},{"$f":"AnACeS_base!J25","v":7.5305587892898718},{"$f":"AnACeS_base!K25","v":7.3582540735825406},{"$f":"AnACeS_base!L25","v":7.5353447019384925},{"$f":"AnACeS_base!M25","v":7.7018815433047809},{"$f":"AnACeS_base!N25","v":8.2117897295654814},{"$f":"AnACeS_base!O25","v":8.194897067005801},{"$f":"AnACeS_base!P25","v":8.5035397509968256},{"$f":"AnACeS_base!Q25","v":8.4335378323108383},{"$f":"AnACeS_base!R25","v":8.859429310484197},{"$f":"AnACeS_base!S25","v":8.8242483500366653}]
[null,null,{"$f":"AnACeS_base!D1","v":""},{"$f":"AnACeS_base!F26","v":""},{"$f":"AnACeS_base!G26","v":""},{"$f":"AnACeS_base!H26","v":""},{"$f":"AnACeS_base!I26","v":""},{"$f":"AnACeS_base!J26","v":""},{"$f":"AnACeS_base!K26","v":""},{"$f":"AnACeS_base!L26","v":""},{"$f":"AnACeS_base!M26","v":""},{"$f":"AnACeS_base!N26","v":""},{"$f":"AnACeS_base!O26","v":""},{"$f":"AnACeS_base!P26","v":""},{"$f":"AnACeS_base!Q26","v":""},{"$f":"AnACeS_base!R26","v":""},{"$f":"AnACeS_base!S26","v":""}]
[]
[null,null,"Fonte: INE"]
[]
[null,null,"PROPORÇÃO (%) DE NASCIMENTOS EM MULHERES COM IDADE INFERIOR A 20 ANOS, 1996-2011 (MÉDIA ANUAL POR TRIÉNIOS)",null,null,null,null,null,"PROPORÇÃO (%) DE NASCIMENTOS EM MULHERES COM IDADE IGUAL OU SUPERIOR A 35 ANOS, 1996-2011 (MÉDIA ANUAL POR TRIÉNIOS)"]
[]
[]
[]
[]
[]
[]
[]
[]
[]
[]
[]
[]
[]
[]
[]
[null,null,"PROPORÇÃO (%) DE NASCIMENTOS PRÉ-TERMO, 1996-2011 (MÉDIA ANUAL POR TRIÉNIOS)",null,null,null,null,null,"PROPORÇÃO (%) DE BAIXO PESO À NASCENÇA, 1996-2011 (MÉDIA ANUAL POR TRIÉNIOS)"]
[]
[]
[]
[]
[]
[]
[]
[]
[]
[]
[]
[]
[]
[]
[]
[]
[]
[]
[null,null,"MORTALIDADE INFANTIL E COMPONENTES"]
[]
[null,null,"Local de residência","96-98","97-99","98-00","99-01","00-02","01-03","02-04","03-05","04-06","05-07","06-08","07-09","08-10","09-11"]
[]
[null,null,"TAXA DE MORTALIDADE INFANTIL"]
[null,null,{"$f":"AnACeS_base!$D$15","v":"Continente"},{"$f":"AnACeS_base!F27","v":6.2211196121505949},{"$f":"AnACeS_base!G27","v":5.8287886351023293},{"$f":"AnACeS_base!H27","v":5.5013411984609597},{"$f":"AnACeS_base!I27","v":5.173492760755579},{"$f":"AnACeS_base!J27","v":5.0154121022351354},{"$f":"AnACeS_base!K27","v":4.6119855532668748},{"$f":"AnACeS_base!L27","v":4.261439636424293},{"$f":"AnACeS_base!M27","v":3.7480708458881455},{"$f":"AnACeS_base!N27","v":3.4818986953485491},{"$f":"AnACeS_base!O27","v":3.3593505255650573},{"$f":"AnACeS_base!P27","v":3.3108439439287105},{"$f":"AnACeS_base!Q27","v":3.4136394011835787},{"$f":"AnACeS_base!R27","v":3.1017498290238121},{"$f":"AnACeS_base!S27","v":3.0444043564398542}]
[null,null,{"$f":"AnACeS_base!$D$16","v":"Região de Saúde do Alentejo"},{"$f":"AnACeS_base!F28","v":4.9566294919454768},{"$f":"AnACeS_base!G28","v":4.5668617097188529},{"$f":"AnACeS_base!H28","v":4.6037254763085205},{"$f":"AnACeS_base!I28","v":4.3199654402764782},{"$f":"AnACeS_base!J28","v":4.583818393480791},{"$f":"AnACeS_base!K28","v":4.6449900464498999},{"$f":"AnACeS_base!L28","v":4.8826701646990234},{"$f":"AnACeS_base!M28","v":4.4659199062888932},{"$f":"AnACeS_base!N28","v":3.7982376177453658},{"$f":"AnACeS_base!O28","v":3.6563071297989032},{"$f":"AnACeS_base!P28","v":3.8245585482952236},{"$f":"AnACeS_base!Q28","v":4.6625766871165641},{"$f":"AnACeS_base!R28","v":4.0417104518632287},{"$f":"AnACeS_base!S28","v":3.3406665037073249}]
[null,null,{"$f":"AnACeS_base!D1","v":""},{"$f":"AnACeS_base!F29","v":""},{"$f":"AnACeS_base!G29","v":""},{"$f":"AnACeS_base!H29","v":""},{"$f":"AnACeS_base!I29","v":""},{"$f":"AnACeS_base!J29","v":""},{"$f":"AnACeS_base!K29","v":""},{"$f":"AnACeS_base!L29","v":""},{"$f":"AnACeS_base!M29","v":""},{"$f":"AnACeS_base!N29","v":""},{"$f":"AnACeS_base!O29","v":""},{"$f":"AnACeS_base!P29","v":""},{"$f":"AnACeS_base!Q29","v":""},{"$f":"AnACeS_base!R29","v":""},{"$f":"AnACeS_base!S29","v":""}]
[]
[null,null,"TAXA DE MORTALIDADE NEONATAL"]
[null,null,"Continente",{"$f":"AnACeS_base!F30","v":3.8759689922480618},{"$f":"AnACeS_base!G30","v":3.695700028213817},{"$f":"AnACeS_base!H30","v":3.4440277221473741},{"$f":"AnACeS_base!I30","v":3.1776121125956172},{"$f":"AnACeS_base!J30","v":3.1433981017656079},{"$f":"AnACeS_base!K30","v":2.9416988934350878},{"$f":"AnACeS_base!L30","v":2.8325669666040354},{"$f":"AnACeS_base!M30","v":2.4252223120452712},{"$f":"AnACeS_base!N30","v":2.2483863178023902},{"$f":"AnACeS_base!O30","v":2.1029267674916183},{"$f":"AnACeS_base!P30","v":2.0798457870440825},{"$f":"AnACeS_base!Q30","v":2.177013220532817},{"$f":"AnACeS_base!R30","v":2.0413520589677874},{"$f":"AnACeS_base!S30","v":2.1264756855225992}]
[null,null,"Região de Saúde do Alentejo",{"$f":"AnACeS_base!F31","v":3.2801224579050952},{"$f":"AnACeS_base!G31","v":3.1397174254317113},{"$f":"AnACeS_base!H31","v":2.6205821942063885},{"$f":"AnACeS_base!I31","v":2.5919792641658868},{"$f":"AnACeS_base!J31","v":2.9103608847497093},{"$f":"AnACeS_base!K31","v":3.1703900317039002},{"$f":"AnACeS_base!L31","v":3.570908030899286},{"$f":"AnACeS_base!M31","v":3.221319276667399},{"$f":"AnACeS_base!N31","v":2.9626253418413855},{"$f":"AnACeS_base!O31","v":2.3845481281297194},{"$f":"AnACeS_base!P31","v":2.1970868256164051},{"$f":"AnACeS_base!Q31","v":2.6175869120654394},{"$f":"AnACeS_base!R31","v":2.263357853043408},{"$f":"AnACeS_base!S31","v":2.1999511121975068}]
[null,null,{"$f":"AnACeS_base!D1","v":""},{"$f":"AnACeS_base!F32","v":""},{"$f":"AnACeS_base!G32","v":""},{"$f":"AnACeS_base!H32","v":""},{"$f":"AnACeS_base!I32","v":""},{"$f":"AnACeS_base!J32","v":""},{"$f":"AnACeS_base!K32","v":""},{"$f":"AnACeS_base!L32","v":""},{"$f":"AnACeS_base!M32","v":""},{"$f":"AnACeS_base!N32","v":""},{"$f":"AnACeS_base!O32","v":""},{"$f":"AnACeS_base!P32","v":""},{"$f":"AnACeS_base!Q32","v":""},{"$f":"AnACeS_base!R32","v":""},{"$f":"AnACeS_base!S32","v":""}]
[]
[null,null,"TAXA DE MORTALIDADE NEONATAL PRECOCE"]
[null,null,"Continente",{"$f":"AnACeS_base!F33","v":2.843850213367674},{"$f":"AnACeS_base!G33","v":2.6787624365576663},{"$f":"AnACeS_base!H33","v":2.5792278095376813},{"$f":"AnACeS_base!I33","v":2.3573871886942626},{"$f":"AnACeS_base!J33","v":2.3476397074292126},{"$f":"AnACeS_base!K33","v":2.2093903765312257},{"$f":"AnACeS_base!L33","v":2.0835103687687462},{"$f":"AnACeS_base!M33","v":1.7510168998693127},{"$f":"AnACeS_base!N33","v":1.5859444854164899},{"$f":"AnACeS_base!O33","v":1.5530330802711474},{"$f":"AnACeS_base!P33","v":1.5286021069006916},{"$f":"AnACeS_base!Q33","v":1.5466438861063843},{"$f":"AnACeS_base!R33","v":1.3988960810185345},{"$f":"AnACeS_base!S33","v":1.3999298263023776}]
[null,null,"Região de Saúde do Alentejo",{"$f":"AnACeS_base!F34","v":1.8222902543917197},{"$f":"AnACeS_base!G34","v":1.7839303553589267},{"$f":"AnACeS_base!H34","v":1.8414901905234082},{"$f":"AnACeS_base!I34","v":1.8719850241198071},{"$f":"AnACeS_base!J34","v":2.037252619324796},{"$f":"AnACeS_base!K34","v":2.2856300228563002},{"$f":"AnACeS_base!L34","v":2.6963999416994606},{"$f":"AnACeS_base!M34","v":2.6356248627278718},{"$f":"AnACeS_base!N34","v":2.4308720753570343},{"$f":"AnACeS_base!O34","v":1.9076385025037754},{"$f":"AnACeS_base!P34","v":1.8715924810806412},{"$f":"AnACeS_base!Q34","v":2.2085889570552149},{"$f":"AnACeS_base!R34","v":1.9400210168943497},{"$f":"AnACeS_base!S34","v":1.7925527580868574}]
[null,null,{"$f":"AnACeS_base!D1","v":""},{"$f":"AnACeS_base!F35","v":""},{"$f":"AnACeS_base!G35","v":""},{"$f":"AnACeS_base!H35","v":""},{"$f":"AnACeS_base!I35","v":""},{"$f":"AnACeS_base!J35","v":""},{"$f":"AnACeS_base!K35","v":""},{"$f":"AnACeS_base!L35","v":""},{"$f":"AnACeS_base!M35","v":""},{"$f":"AnACeS_base!N35","v":""},{"$f":"AnACeS_base!O35","v":""},{"$f":"AnACeS_base!P35","v":""},{"$f":"AnACeS_base!Q35","v":""},{"$f":"AnACeS_base!R35","v":""},{"$f":"AnACeS_base!S35","v":""}]
[]
[null,null,"TAXA DE MORTALIDADE PÓS-NEONATAL"]
[null,null,"Continente",{"$f":"AnACeS_base!F36","v":2.3451506199025327},{"$f":"AnACeS_base!G36","v":2.1330886068885122},{"$f":"AnACeS_base!H36","v":2.0573134763135856},{"$f":"AnACeS_base!I36","v":1.995880648159962},{"$f":"AnACeS_base!J36","v":1.872014000469528},{"$f":"AnACeS_base!K36","v":1.6702866598317871},{"$f":"AnACeS_base!L36","v":1.4288726698202578},{"$f":"AnACeS_base!M36","v":1.322848533842875},{"$f":"AnACeS_base!N36","v":1.2335123775461587},{"$f":"AnACeS_base!O36","v":1.2564237580734392},{"$f":"AnACeS_base!P36","v":1.2309981568846278},{"$f":"AnACeS_base!Q36","v":1.2366261806507617},{"$f":"AnACeS_base!R36","v":1.0603977700560248},{"$f":"AnACeS_base!S36","v":0.91792867091725527}]
[null,null,"Região de Saúde do Alentejo",{"$f":"AnACeS_base!F37","v":1.6765070340403818},{"$f":"AnACeS_base!G37","v":1.4271442842871414},{"$f":"AnACeS_base!H37","v":1.9831432821021318},{"$f":"AnACeS_base!I37","v":1.727986176110591},{"$f":"AnACeS_base!J37","v":1.6734575087310826},{"$f":"AnACeS_base!K37","v":1.4746000147460001},{"$f":"AnACeS_base!L37","v":1.3117621337997378},{"$f":"AnACeS_base!M37","v":1.2446006296214949},{"$f":"AnACeS_base!N37","v":0.83561227590398057},{"$f":"AnACeS_base!O37","v":1.2717590016691835},{"$f":"AnACeS_base!P37","v":1.6274717226788185},{"$f":"AnACeS_base!Q37","v":2.0449897750511248},{"$f":"AnACeS_base!R37","v":1.7783525988198206},{"$f":"AnACeS_base!S37","v":1.1407153915098183}]
[null,null,{"$f":"AnACeS_base!D1","v":""},{"$f":"AnACeS_base!F38","v":""},{"$f":"AnACeS_base!G38","v":""},{"$f":"AnACeS_base!H38","v":""},{"$f":"AnACeS_base!I38","v":""},{"$f":"AnACeS_base!J38","v":""},{"$f":"AnACeS_base!K38","v":""},{"$f":"AnACeS_base!L38","v":""},{"$f":"AnACeS_base!M38","v":""},{"$f":"AnACeS_base!N38","v":""},{"$f":"AnACeS_base!O38","v":""},{"$f":"AnACeS_base!P38","v":""},{"$f":"AnACeS_base!Q38","v":""},{"$f":"AnACeS_base!R38","v":""},{"$f":"AnACeS_base!S38","v":""}]
[]
[null,null,"TAXA DE MORTALIDADE FETAL TARDIA"]
[null,null,"Continente",{"$f":"AnACeS_base!F39","v":0.42022749488466526},{"$f":"AnACeS_base!G39","v":0.38513329874237145},{"$f":"AnACeS_base!H39","v":0.37364869767104403},{"$f":"AnACeS_base!I39","v":0.3553785053518671},{"$f":"AnACeS_base!J39","v":0.34636874903153475},{"$f":"AnACeS_base!K39","v":0.32087122906416182},{"$f":"AnACeS_base!L39","v":0.29685043570489428},{"$f":"AnACeS_base!M39","v":0.27594821350616744},{"$f":"AnACeS_base!N39","v":0.27855697075802643},{"$f":"AnACeS_base!O39","v":0.28446665824787148},{"$f":"AnACeS_base!P39","v":0.27688219185473972},{"$f":"AnACeS_base!Q39","v":0.26967511877728956},{"$f":"AnACeS_base!R39","v":0.25735458776756093},{"$f":"AnACeS_base!S39","v":0.25029607763420714}]
[null,null,"Região de Saúde do Alentejo",{"$f":"AnACeS_base!F40","v":0.37037037037037041},{"$f":"AnACeS_base!G40","v":0.44753853804077576},{"$f":"AnACeS_base!H40","v":0.49333991119881598},{"$f":"AnACeS_base!I40","v":0.58693006942953263},{"$f":"AnACeS_base!J40","v":0.54992764109985526},{"$f":"AnACeS_base!K40","v":0.46965583033683134},{"$f":"AnACeS_base!L40","v":0.39921608477897946},{"$f":"AnACeS_base!M40","v":0.37925753045000365},{"$f":"AnACeS_base!N40","v":0.35576413594731665},{"$f":"AnACeS_base!O40","v":0.43526432415321298},{"$f":"AnACeS_base!P40","v":0.36484514350575648},{"$f":"AnACeS_base!Q40","v":0.3829856584093872},{"$f":"AnACeS_base!R40","v":0.3463831158369583},{"$f":"AnACeS_base!S40","v":0.32485990416632826}]
[null,null,{"$f":"AnACeS_base!D1","v":""},{"$f":"AnACeS_base!F41","v":""},{"$f":"AnACeS_base!G41","v":""},{"$f":"AnACeS_base!H41","v":""},{"$f":"AnACeS_base!I41","v":""},{"$f":"AnACeS_base!J41","v":""},{"$f":"AnACeS_base!K41","v":""},{"$f":"AnACeS_base!L41","v":""},{"$f":"AnACeS_base!M41","v":""},{"$f":"AnACeS_base!N41","v":""},{"$f":"AnACeS_base!O41","v":""},{"$f":"AnACeS_base!P41","v":""},{"$f":"AnACeS_base!Q41","v":""},{"$f":"AnACeS_base!R41","v":""},{"$f":"AnACeS_base!S41","v":""}]
[]
[null,null,"TAXA DE MORTALIDADE PERINATAL"]
[null,null,"Continente",{"$f":"AnACeS_base!F42","v":7.0341745217044203},{"$f":"AnACeS_base!G42","v":6.5197786178439951},{"$f":"AnACeS_base!H42","v":6.3060775351278151},{"$f":"AnACeS_base!I42","v":5.9027945948563953},{"$f":"AnACeS_base!J42","v":5.8031957074581699},{"$f":"AnACeS_base!K42","v":5.4110133691168434},{"$f":"AnACeS_base!L42","v":5.0458298162100421},{"$f":"AnACeS_base!M42","v":4.5056671350776067},{"$f":"AnACeS_base!N42","v":4.3670964340802731},{"$f":"AnACeS_base!O42","v":4.3932818014449309},{"$f":"AnACeS_base!P42","v":4.2931915984297637},{"$f":"AnACeS_base!Q42","v":4.2392241601423608},{"$f":"AnACeS_base!R42","v":3.968841835451542},{"$f":"AnACeS_base!S42","v":3.8993866331995828}]
[null,null,"Região de Saúde do Alentejo",{"$f":"AnACeS_base!F43","v":5.5192447349310099},{"$f":"AnACeS_base!G43","v":6.2513319599346451},{"$f":"AnACeS_base!H43","v":6.7658044964409054},{"$f":"AnACeS_base!I43","v":7.7302984754133561},{"$f":"AnACeS_base!J43","v":7.5253256150506509},{"$f":"AnACeS_base!K43","v":6.9714537315623391},{"$f":"AnACeS_base!L43","v":6.67779632721202},{"$f":"AnACeS_base!M43","v":6.4182043614616004},{"$f":"AnACeS_base!N43","v":5.9798652637953227},{"$f":"AnACeS_base!O43","v":6.2519784742006959},{"$f":"AnACeS_base!P43","v":5.5132155018647646},{"$f":"AnACeS_base!Q43","v":6.0299869621903515},{"$f":"AnACeS_base!R43","v":5.3971322700177211},{"$f":"AnACeS_base!S43","v":5.0353285145780884}]
[null,null,{"$f":"AnACeS_base!D1","v":""},{"$f":"AnACeS_base!F44","v":""},{"$f":"AnACeS_base!G44","v":""},{"$f":"AnACeS_base!H44","v":""},{"$f":"AnACeS_base!I44","v":""},{"$f":"AnACeS_base!J44","v":""},{"$f":"AnACeS_base!K44","v":""},{"$f":"AnACeS_base!L44","v":""},{"$f":"AnACeS_base!M44","v":""},{"$f":"AnACeS_base!N44","v":""},{"$f":"AnACeS_base!O44","v":""},{"$f":"AnACeS_base!P44","v":""},{"$f":"AnACeS_base!Q44","v":""},{"$f":"AnACeS_base!R44","v":""},{"$f":"AnACeS_base!S44","v":""}]
[]
[null,null,"Fonte: INE"]
[]
[null,null,"TAXA DE MORTALIDADE INFANTIL (/1000 NADOS VIVOS), 1996-2011 (MÉDIA ANUAL POR TRIÉNIOS)",null,null,null,null,null,"TAXA DE MORTALIDADE NEONATAL (/1000 NADOS VIVOS), 1996-2011 (MÉDIA ANUAL POR TRIÉNIOS)"]
[]
[]
[]
[]
[]
[]
[]
[]
[]
[]
[]
[]
[]
[]
[null,null,"TAXA DE MORTALIDADE NEONATAL PRECOCE (/1000 NADOS VIVOS), 1996-2011 (MÉDIA ANUAL POR TRIÉNIOS)",null,null,null,null,null,"TAXA DE MORTALIDADE PÓS-NEONATAL (/1000 NADOS VIVOS), 1996-2011 (MÉDIA ANUAL POR TRIÉNIOS)"]
[]
[]
[]
[]
[]
[]
[]
[]
[]
[]
[]
[]
[]
[]
[null,null,"TAXA DE MORTALIDADE FETAL TARDIA (/1000 (NV+FM 28+ SEM)), 1996-2011 (MÉDIA ANUAL POR TRIÉNIOS)",null,null,null,null,null,"TAXA DE MORTALIDADE PERINATAL (/1000 (NV+FM 28+ SEM)), 1996-2011 (MÉDIA ANUAL POR TRIÉNIOS)"]

{"sheet":"AnACeS_base","index":8,"n_rows":44,"n_cols":21,"rows_kept":44,"cut":false,"hidden":true,"merged":[]}
[null,"AnACeS_Select",1,{"$f":"IF(AnACeS_Select=1,\"\",VLOOKUP(AnACeS_Select,AnACeS_tab,3,FALSE))","v":""}]
[null,null,null,null,null,2,3,4,5,6,7,8,9,10,11,12,13,14,15,16,17]
["Icod","Indicador","Rcod","Local_Residencia","cod_IndRes",1996,1997,1998,1999,2000,2001,2002,2003,2004,2005,2006,2007,2008,2009,2010,2011]
["I02","Taxa Bruta de Natalidade",{"$f":"Id!$D$39","v":"R01"},{"$f":"Id!$F$39","v":"Continente"},"I02R01",{"$f":"VLOOKUP($E4,BaseAnual,F$2,FALSE)","v":10.829251263010473},11.062798362732069,11.074425055020015,11.283982266421486,11.624032835087226,10.847899468123961,10.9401654089265,10.666349115393958,10.312637865236345,10.277295687943065,9.8762778616238514,9.5789175067182128,9.7775220633861419,9.3020554136194296,9.4765813607090514,9.1270272177506637]
["I02","Taxa Bruta de Natalidade",{"$f":"Id!$D$40","v":"R02"},{"$f":"Id!$F$40","v":"Região de Saúde do Alentejo"},"I02R02",8.3200127271763087,8.8691669758759808,8.8462430558988263,8.9275512458199717,9.1064335866921802,8.4354709359596516,8.6710222186593988,8.790002686524641,8.7865643421198971,8.6236849121125232,7.9362852883674995,7.7858890252841837,8.2185329094548454,7.9882253795297267,8.2689555082315511,8.0236826152889407]
["I02","Taxa Bruta de Natalidade",{"$f":"IF(AnACeS_Select=1,\"\",VLOOKUP(AnACeS_Select,AnACeS_tab,2,FALSE))","v":""},{"$f":"IF(AnACeS_Select=1,\"\",VLOOKUP(AnACeS_Select,AnACeS_tab,3,FALSE))","v":""},{"$f":"IF(C6=\"\",\"\",CONCATENATE(A6,C6))","v":""},{"$f":"IF(AnACeS_base!$C6=\"\",\"\",VLOOKUP($E6,BaseAnual,F$2,FALSE))","v":""},{"$f":"IF(AnACeS_base!$C6=\"\",\"\",VLOOKUP($E6,BaseAnual,G$2,FALSE))","v":""},{"$f":"IF(AnACeS_base!$C6=\"\",\"\",VLOOKUP($E6,BaseAnual,H$2,FALSE))","v":""},{"$f":"IF(AnACeS_base!$C6=\"\",\"\",VLOOKUP($E6,BaseAnual,I$2,FALSE))","v":""},{"$f":"IF(AnACeS_base!$C6=\"\",\"\",VLOOKUP($E6,BaseAnual,J$2,FALSE))","v":""},{"$f":"IF(AnACeS_base!$C6=\"\",\"\",VLOOKUP($E6,BaseAnual,K$2,FALSE))","v":""},{"$f":"IF(AnACeS_base!$C6=\"\",\"\",VLOOKUP($E6,BaseAnual,L$2,FALSE))","v":""},{"$f":"IF(AnACeS_base!$C6=\"\",\"\",VLOOKUP($E6,BaseAnual,M$2,FALSE))","v":""},{"$f":"IF(AnACeS_base!$C6=\"\",\"\",VLOOKUP($E6,BaseAnual,N$2,FALSE))","v":""},{"$f":"IF(AnACeS_base!$C6=\"\",\"\",VLOOKUP($E6,BaseAnual,O$2,FALSE))","v":""},{"$f":"IF(AnACeS_base!$C6=\"\",\"\",VLOOKUP($E6,BaseAnual,P$2,FALSE))","v":""},{"$f":"IF(AnACeS_base!$C6=\"\",\"\",VLOOKUP($E6,BaseAnual,Q$2,FALSE))","v":""},{"$f":"IF(AnACeS_base!$C6=\"\",\"\",VLOOKUP($E6,BaseAnual,R$2,FALSE))","v":""},{"$f":"IF(AnACeS_base!$C6=\"\",\"\",VLOOKUP($E6,BaseAnual,S$2,FALSE))","v":""},{"$f":"IF(AnACeS_base!$C6=\"\",\"\",VLOOKUP($E6,BaseAnual,T$2,FALSE))","v":""},{"$f":"IF(AnACeS_base!$C6=\"\",\"\",VLOOKUP($E6,BaseAnual,U$2,FALSE))","v":""}]
["I13","Taxa Bruta de Mortalidade",{"$f":"Id!$D$39","v":"R01"},{"$f":"Id!$F$39","v":"Continente"},"I13R01",{"$f":"VLOOKUP($E7,BaseAnual,F$2,FALSE)","v":10.599228389209983},10.340119204595007,10.451250926457213,10.591145074392827,10.260041548547093,10.157877744614126,10.20079013653972,10.374066730849643,9.6774626652392612,10.168282021634095,9.6113270199096927,9.7511749554075084,9.8114769337113579,9.7962308056474061,9.9402914157450457,9.7502926968952082]
["I13","Taxa Bruta de Mortalidade",{"$f":"Id!$D$40","v":"R02"},{"$f":"Id!$F$40","v":"Região de Saúde do Alentejo"},"I13R02",15.092688691752336,14.517495869564598,14.901537303274232,15.023347222328018,14.389613557874835,14.218050153194485,14.452339916286368,15.224277004591949,13.565289427358392,15.195394798262559,13.699862537038095,14.15633886042543,14.792574276855449,14.595623291275466,14.898084375264951,14.15817052189249]
["I13","Taxa Bruta de Mortalidade",{"$f":"IF(AnACeS_Select=1,\"\",VLOOKUP(AnACeS_Select,AnACeS_tab,2,FALSE))","v":""},{"$f":"IF(AnACeS_Select=1,\"\",VLOOKUP(AnACeS_Select,AnACeS_tab,3,FALSE))","v":""},{"$f":"IF(C6=\"\",\"\",CONCATENATE(A9,C9))","v":""},{"$f":"IF(AnACeS_base!$C9=\"\",\"\",VLOOKUP($E9,BaseAnual,F$2,FALSE))","v":""},{"$f":"IF(AnACeS_base!$C9=\"\",\"\",VLOOKUP($E9,BaseAnual,G$2,FALSE))","v":""},{"$f":"IF(AnACeS_base!$C9=\"\",\"\",VLOOKUP($E9,BaseAnual,H$2,FALSE))","v":""},{"$f":"IF(AnACeS_base!$C9=\"\",\"\",VLOOKUP($E9,BaseAnual,I$2,FALSE))","v":""},{"$f":"IF(AnACeS_base!$C9=\"\",\"\",VLOOKUP($E9,BaseAnual,J$2,FALSE))","v":""},{"$f":"IF(AnACeS_base!$C9=\"\",\"\",VLOOKUP($E9,BaseAnual,K$2,FALSE))","v":""},{"$f":"IF(AnACeS_base!$C9=\"\",\"\",VLOOKUP($E9,BaseAnual,L$2,FALSE))","v":""},{"$f":"IF(AnACeS_base!$C9=\"\",\"\",VLOOKUP($E9,BaseAnual,M$2,FALSE))","v":""},{"$f":"IF(AnACeS_base!$C9=\"\",\"\",VLOOKUP($E9,BaseAnual,N$2,FALSE))","v":""},{"$f":"IF(AnACeS_base!$C9=\"\",\"\",VLOOKUP($E9,BaseAnual,O$2,FALSE))","v":""},{"$f":"IF(AnACeS_base!$C9=\"\",\"\",VLOOKUP($E9,BaseAnual,P$2,FALSE))","v":""},{"$f":"IF(AnACeS_base!$C9=\"\",\"\",VLOOKUP($E9,BaseAnual,Q$2,FALSE))","v":""},{"$f":"IF(AnACeS_base!$C9=\"\",\"\",VLOOKUP($E9,BaseAnual,R$2,FALSE))","v":""},{"$f":"IF(AnACeS_base!$C9=\"\",\"\",VLOOKUP($E9,BaseAnual,S$2,FALSE))","v":""},{"$f":"IF(AnACeS_base!$C9=\"\",\"\",VLOOKUP($E9,BaseAnual,T$2,FALSE))","v":""},{"$f":"IF(AnACeS_base!$C9=\"\",\"\",VLOOKUP($E9,BaseAnual,U$2,FALSE))","v":""}]
["I11","Índice sintético de fecundidade (ISF)",{"$f":"Id!$D$39","v":"R01"},{"$f":"Id!$F$39","v":"Continente"},"I11R01",{"$f":"VLOOKUP($E10,BaseAnual,F$2,FALSE)","v":1.430507731594074},1.4679288630178684,1.4637594982914837,1.4962981940770692,1.5472896537816896,1.4469283079890394,1.4634999121024463,1.4332475342263216,1.3970947804939711,1.4046959859236119,5.6736516992738961E-2,1.3362079621269598,1.379282825499224,1.3315990813610639,1.3784335607715392,1.3061603200181457]
["I11","Índice sintético de fecundidade (ISF)",{"$f":"Id!$D$40","v":"R02"},{"$f":"Id!$F$40","v":"Região de Saúde do Alentejo"},"I11R02",1.3116590097766627,1.3995163895268761,1.4053687644051407,1.4241955472817605,1.4544793358989501,1.3433136495503188,1.3775001047586575,1.3957318296034498,1.3952553471110603,1.3705431282879126,1.2617072196897632,1.2444667684510495,1.310492874331054,1.2858276589555724,1.3481265036763188,1.3246993141546546]
["I11","Índice sintético de fecundidade (ISF)",{"$f":"IF(AnACeS_Select=1,\"\",VLOOKUP(AnACeS_Select,AnACeS_tab,2,FALSE))","v":""},{"$f":"IF(AnACeS_Select=1,\"\",VLOOKUP(AnACeS_Select,AnACeS_tab,3,FALSE))","v":""},{"$f":"IF(C12=\"\",\"\",CONCATENATE(A12,C12))","v":""},{"$f":"IF(AnACeS_base!$C12=\"\",\"\",VLOOKUP($E12,BaseAnual,F$2,FALSE))","v":""},{"$f":"IF(AnACeS_base!$C12=\"\",\"\",VLOOKUP($E12,BaseAnual,G$2,FALSE))","v":""},{"$f":"IF(AnACeS_base!$C12=\"\",\"\",VLOOKUP($E12,BaseAnual,H$2,FALSE))","v":""},{"$f":"IF(AnACeS_base!$C12=\"\",\"\",VLOOKUP($E12,BaseAnual,I$2,FALSE))","v":""},{"$f":"IF(AnACeS_base!$C12=\"\",\"\",VLOOKUP($E12,BaseAnual,J$2,FALSE))","v":""},{"$f":"IF(AnACeS_base!$C12=\"\",\"\",VLOOKUP($E12,BaseAnual,K$2,FALSE))","v":""},{"$f":"IF(AnACeS_base!$C12=\"\",\"\",VLOOKUP($E12,BaseAnual,L$2,FALSE))","v":""},{"$f":"IF(AnACeS_base!$C12=\"\",\"\",VLOOKUP($E12,BaseAnual,M$2,FALSE))","v":""},{"$f":"IF(AnACeS_base!$C12=\"\",\"\",VLOOKUP($E12,BaseAnual,N$2,FALSE))","v":""},{"$f":"IF(AnACeS_base!$C12=\"\",\"\",VLOOKUP($E12,BaseAnual,O$2,FALSE))","v":""},{"$f":"IF(AnACeS_base!$C12=\"\",\"\",VLOOKUP($E12,BaseAnual,P$2,FALSE))","v":""},{"$f":"IF(AnACeS_base!$C12=\"\",\"\",VLOOKUP($E12,BaseAnual,Q$2,FALSE))","v":""},{"$f":"IF(AnACeS_base!$C12=\"\",\"\",VLOOKUP($E12,BaseAnual,R$2,FALSE))","v":""},{"$f":"IF(AnACeS_base!$C12=\"\",\"\",VLOOKUP($E12,BaseAnual,S$2,FALSE))","v":""},{"$f":"IF(AnACeS_base!$C12=\"\",\"\",VLOOKUP($E12,BaseAnual,T$2,FALSE))","v":""},{"$f":"IF(AnACeS_base!$C12=\"\",\"\",VLOOKUP($E12,BaseAnual,U$2,FALSE))","v":""}]
[null,null,null,null,null,18,19,20,21,22,23,24,25,26,27,28,29,30,31]
["Icod","Indicador","Rcod","Local_Residencia","cod_IndRes","96-98","97-99","98-00","99-01","00-02","01-03","02-04","03-05","04-06","05-07","06-08","07-09","08-10","09-11"]
["I04","Proporção de Nascimentos em Mulheres com Idade Inferior a 20 anos",{"$f":"Id!$D$39","v":"R01"},{"$f":"Id!$F$39","v":"Continente"},"I04R01",{"$f":"VLOOKUP($E15,BaseTrienal,F$13,FALSE)","v":6.6005100623690121},6.3397377665198098,6.1570719392151858,5.9997934248339799,5.8386104412038211,5.5742701065430982,5.3239669785637629,5.0479133182728839,4.7920976889590854,4.5957781495577521,4.3757926241566478,4.2810000482249766,4.0706148925440573,3.8928681549633715]
["I04","Proporção de Nascimentos em Mulheres com Idade Inferior a 20 anos",{"$f":"Id!$D$40","v":"R02"},{"$f":"Id!$F$40","v":"Região de Saúde do Alentejo"},"I04R02",10.343319483927401,9.6403596403596392,9.0233019335646993,8.841529267765857,8.6364959254947617,8.3314900833149004,7.8632852353884273,7.2260048319789147,6.7000911577028255,6.4223829584293775,5.9809585808446579,5.6441717791411046,5.343141217363188,5.3613623400961457]
["I04","Proporção de Nascimentos em Mulheres com Idade Inferior a 20 anos",{"$f":"IF(AnACeS_Select=1,\"\",VLOOKUP(AnACeS_Select,AnACeS_tab,2,FALSE))","v":""},{"$f":"IF(AnACeS_Select=1,\"\",VLOOKUP(AnACeS_Select,AnACeS_tab,3,FALSE))","v":""},{"$f":"IF(C17=\"\",\"\",CONCATENATE(A17,C17))","v":""},{"$f":"IF(AnACeS_base!$C17=\"\",\"\",VLOOKUP($E17,BaseTrienal,F$13,FALSE))","v":""},{"$f":"IF(AnACeS_base!$C17=\"\",\"\",VLOOKUP($E17,BaseTrienal,G$13,FALSE))","v":""},{"$f":"IF(AnACeS_base!$C17=\"\",\"\",VLOOKUP($E17,BaseTrienal,H$13,FALSE))","v":""},{"$f":"IF(AnACeS_base!$C17=\"\",\"\",VLOOKUP($E17,BaseTrienal,I$13,FALSE))","v":""},{"$f":"IF(AnACeS_base!$C17=\"\",\"\",VLOOKUP($E17,BaseTrienal,J$13,FALSE))","v":""},{"$f":"IF(AnACeS_base!$C17=\"\",\"\",VLOOKUP($E17,BaseTrienal,K$13,FALSE))","v":""},{"$f":"IF(AnACeS_base!$C17=\"\",\"\",VLOOKUP($E17,BaseTrienal,L$13,FALSE))","v":""},{"$f":"IF(AnACeS_base!$C17=\"\",\"\",VLOOKUP($E17,BaseTrienal,M$13,FALSE))","v":""},{"$f":"IF(AnACeS_base!$C17=\"\",\"\",VLOOKUP($E17,BaseTrienal,N$13,FALSE))","v":""},{"$f":"IF(AnACeS_base!$C17=\"\",\"\",VLOOKUP($E17,BaseTrienal,O$13,FALSE))","v":""},{"$f":"IF(AnACeS_base!$C17=\"\",\"\",VLOOKUP($E17,BaseTrienal,P$13,FALSE))","v":""},{"$f":"IF(AnACeS_base!$C17=\"\",\"\",VLOOKUP($E17,BaseTrienal,Q$13,FALSE))","v":""},{"$f":"IF(AnACeS_base!$C17=\"\",\"\",VLOOKUP($E17,BaseTrienal,R$13,FALSE))","v":""},{"$f":"IF(AnACeS_base!$C17=\"\",\"\",VLOOKUP($E17,BaseTrienal,S$13,FALSE))","v":""}]
["I06","Proporção de Nascimentos em Mulheres com Idade igual ou superior a 35 anos",{"$f":"Id!$D$39","v":"R01"},{"$f":"Id!$F$39","v":"Continente"},"I06R01",{"$f":"VLOOKUP($E18,BaseTrienal,F$13,FALSE)","v":11.02852056662374},11.798646356852082,12.542026241367173,13.286124832157679,13.845586284905897,14.458886330137144,15.038412755363781,15.711222804119362,16.519276078344351,17.424297969059317,18.401393327584167,19.432598706192774,20.605566570183136,22.210329710055042]
["I06","Proporção de Nascimentos em Mulheres com Idade igual ou superior a 35 anos",{"$f":"Id!$D$40","v":"R02"},{"$f":"Id!$F$40","v":"Região de Saúde do Alentejo"},"I06R02",9.8039215686274517,10.468103325246183,11.43848714498194,12.369501043991649,12.645518044237486,13.013345130133452,13.489287275907301,14.276301339775971,14.896687936797326,15.332644463874095,16.429327040442672,17.267893660531698,18.462533344111229,19.620304733968872]
["I06","Proporção de Nascimentos em Mulheres com Idade igual ou superior a 35 anos",{"$f":"IF(AnACeS_Select=1,\"\",VLOOKUP(AnACeS_Select,AnACeS_tab,2,FALSE))","v":""},{"$f":"IF(AnACeS_Select=1,\"\",VLOOKUP(AnACeS_Select,AnACeS_tab,3,FALSE))","v":""},{"$f":"IF(C20=\"\",\"\",CONCATENATE(A20,C20))","v":""},{"$f":"IF(AnACeS_base!$C20=\"\",\"\",VLOOKUP($E20,BaseTrienal,F$13,FALSE))","v":""},{"$f":"IF(AnACeS_base!$C20=\"\",\"\",VLOOKUP($E20,BaseTrienal,G$13,FALSE))","v":""},{"$f":"IF(AnACeS_base!$C20=\"\",\"\",VLOOKUP($E20,BaseTrienal,H$13,FALSE))","v":""},{"$f":"IF(AnACeS_base!$C20=\"\",\"\",VLOOKUP($E20,BaseTrienal,I$13,FALSE))","v":""},{"$f":"IF(AnACeS_base!$C20=\"\",\"\",VLOOKUP($E20,BaseTrienal,J$13,FALSE))","v":""},{"$f":"IF(AnACeS_base!$C20=\"\",\"\",VLOOKUP($E20,BaseTrienal,K$13,FALSE))","v":""},{"$f":"IF(AnACeS_base!$C20=\"\",\"\",VLOOKUP($E20,BaseTrienal,L$13,FALSE))","v":""},{"$f":"IF(AnACeS_base!$C20=\"\",\"\",VLOOKUP($E20,BaseTrienal,M$13,FALSE))","v":""},{"$f":"IF(AnACeS_base!$C20=\"\",\"\",VLOOKUP($E20,BaseTrienal,N$13,FALSE))","v":""},{"$f":"IF(AnACeS_base!$C20=\"\",\"\",VLOOKUP($E20,BaseTrienal,O$13,FALSE))","v":""},{"$f":"IF(AnACeS_base!$C20=\"\",\"\",VLOOKUP($E20,BaseTrienal,P$13,FALSE))","v":""},{"$f":"IF(AnACeS_base!$C20=\"\",\"\",VLOOKUP($E20,BaseTrienal,Q$13,FALSE))","v":""},{"$f":"IF(AnACeS_base!$C20=\"\",\"\",VLOOKUP($E20,BaseTrienal,R$13,FALSE))","v":""},{"$f":"IF(AnACeS_base!$C20=\"\",\"\",VLOOKUP($E20,BaseTrienal,S$13,FALSE))","v":""}]
["I08","Proporção nascimentos pré-termo",{"$f":"Id!$D$39","v":"R01"},{"$f":"Id!$F$39","v":"Continente"},"I08R01",{"$f":"VLOOKUP($E21,BaseTrienal,F$13,FALSE)","v":0},0,0,0,6.027031394345542,6.3536333409161028,6.7345853279325727,6.7775217998408746,7.1021596256387838,7.8368182151450725,8.6653477400700041,8.9602006159018419,8.5187590237432396,8.0207118731769906]
["I08","Proporção nascimentos pré-termo",{"$f":"Id!$D$40","v":"R02"},{"$f":"Id!$F$40","v":"Região de Saúde do Alentejo"},"I08R02",0,0,0,0,6.257275902211874,6.4366290643662909,6.7118495846086574,6.8526246430924669,7.0723184442418718,8.1154121294014772,8.5686386199039788,8.8016359918200404,8.1157545873413639,7.463537847307097]
["I08","Proporção nascimentos pré-termo",{"$f":"IF(AnACeS_Select=1,\"\",VLOOKUP(AnACeS_Select,AnACeS_tab,2,FALSE))","v":""},{"$f":"IF(AnACeS_Select=1,\"\",VLOOKUP(AnACeS_Select,AnACeS_tab,3,FALSE))","v":""},{"$f":"IF(C23=\"\",\"\",CONCATENATE(A23,C23))","v":""},{"$f":"IF(AnACeS_base!$C23=\"\",\"\",VLOOKUP($E23,BaseTrienal,F$13,FALSE))","v":""},{"$f":"IF(AnACeS_base!$C23=\"\",\"\",VLOOKUP($E23,BaseTrienal,G$13,FALSE))","v":""},{"$f":"IF(AnACeS_base!$C23=\"\",\"\",VLOOKUP($E23,BaseTrienal,H$13,FALSE))","v":""},{"$f":"IF(AnACeS_base!$C23=\"\",\"\",VLOOKUP($E23,BaseTrienal,I$13,FALSE))","v":""},{"$f":"IF(AnACeS_base!$C23=\"\",\"\",VLOOKUP($E23,BaseTrienal,J$13,FALSE))","v":""},{"$f":"IF(AnACeS_base!$C23=\"\",\"\",VLOOKUP($E23,BaseTrienal,K$13,FALSE))","v":""},{"$f":"IF(AnACeS_base!$C23=\"\",\"\",VLOOKUP($E23,BaseTrienal,L$13,FALSE))","v":""},{"$f":"IF(AnACeS_base!$C23=\"\",\"\",VLOOKUP($E23,BaseTrienal,M$13,FALSE))","v":""},{"$f":"IF(AnACeS_base!$C23=\"\",\"\",VLOOKUP($E23,BaseTrienal,N$13,FALSE))","v":""},{"$f":"IF(AnACeS_base!$C23=\"\",\"\",VLOOKUP($E23,BaseTrienal,O$13,FALSE))","v":""},{"$f":"IF(AnACeS_base!$C23=\"\",\"\",VLOOKUP($E23,BaseTrienal,P$13,FALSE))","v":""},{"$f":"IF(AnACeS_base!$C23=\"\",\"\",VLOOKUP($E23,BaseTrienal,Q$13,FALSE))","v":""},{"$f":"IF(AnACeS_base!$C23=\"\",\"\",VLOOKUP($E23,BaseTrienal,R$13,FALSE))","v":""},{"$f":"IF(AnACeS_base!$C23=\"\",\"\",VLOOKUP($E23,BaseTrienal,S$13,FALSE))","v":""}]
["I10","Proporção de Baixo Peso à Nascença",{"$f":"Id!$D$39","v":"R01"},{"$f":"Id!$F$39","v":"Continente"},"I10R01",{"$f":"VLOOKUP($E24,BaseTrienal,F$13,FALSE)","v":6.524442592732874},6.882311176702208,7.071939215186493,7.231042171712569,7.1993268066916878,7.3056344128911226,7.4430417992465374,7.5060470793485452,7.5629319740766601,7.6481880169833829,7.7140296589391104,7.9181966614537762,8.0821652838895535,8.3258611340494841]
["I10","Proporção de Baixo Peso à Nascença",{"$f":"Id!$D$40","v":"R02"},{"$f":"Id!$F$40","v":"Região de Saúde do Alentejo"},"I10R02",6.8372330344777312,7.3212501783930346,7.6138536723563996,7.7687378500971986,7.5305587892898718,7.3582540735825406,7.5353447019384925,7.7018815433047809,8.2117897295654814,8.194897067005801,8.5035397509968256,8.4335378323108383,8.859429310484197,8.8242483500366653]
["I10","Proporção de Baixo Peso à Nascença",{"$f":"IF(AnACeS_Select=1,\"\",VLOOKUP(AnACeS_Select,AnACeS_tab,2,FALSE))","v":""},{"$f":"IF(AnACeS_Select=1,\"\",VLOOKUP(AnACeS_Select,AnACeS_tab,3,FALSE))","v":""},{"$f":"IF(C26=\"\",\"\",CONCATENATE(A26,C26))","v":""},{"$f":"IF(AnACeS_base!$C26=\"\",\"\",VLOOKUP($E26,BaseTrienal,F$13,FALSE))","v":""},{"$f":"IF(AnACeS_base!$C26=\"\",\"\",VLOOKUP($E26,BaseTrienal,G$13,FALSE))","v":""},{"$f":"IF(AnACeS_base!$C26=\"\",\"\",VLOOKUP($E26,BaseTrienal,H$13,FALSE))","v":""},{"$f":"IF(AnACeS_base!$C26=\"\",\"\",VLOOKUP($E26,BaseTrienal,I$13,FALSE))","v":""},{"$f":"IF(AnACeS_base!$C26=\"\",\"\",VLOOKUP($E26,BaseTrienal,J$13,FALSE))","v":""},{"$f":"IF(AnACeS_base!$C26=\"\",\"\",VLOOKUP($E26,BaseTrienal,K$13,FALSE))","v":""},{"$f":"IF(AnACeS_base!$C26=\"\",\"\",VLOOKUP($E26,BaseTrienal,L$13,FALSE))","v":""},{"$f":"IF(AnACeS_base!$C26=\"\",\"\",VLOOKUP($E26,BaseTrienal,M$13,FALSE))","v":""},{"$f":"IF(AnACeS_base!$C26=\"\",\"\",VLOOKUP($E26,BaseTrienal,N$13,FALSE))","v":""},{"$f":"IF(AnACeS_base!$C26=\"\",\"\",VLOOKUP($E26,BaseTrienal,O$13,FALSE))","v":""},{"$f":"IF(AnACeS_base!$C26=\"\",\"\",VLOOKUP($E26,BaseTrienal,P$13,FALSE))","v":""},{"$f":"IF(AnACeS_base!$C26=\"\",\"\",VLOOKUP($E26,BaseTrienal,Q$13,FALSE))","v":""},{"$f":"IF(AnACeS_base!$C26=\"\",\"\",VLOOKUP($E26,BaseTrienal,R$13,FALSE))","v":""},{"$f":"IF(AnACeS_base!$C26=\"\",\"\",VLOOKUP($E26,BaseTrienal,S$13,FALSE))","v":""}]
["I15","Taxa de Mortalidade Infantil",{"$f":"Id!$D$39","v":"R01"},{"$f":"Id!$F$39","v":"Continente"},"I15R01",{"$f":"VLOOKUP($E27,BaseTrienal,F$13,FALSE)","v":6.2211196121505949},5.8287886351023293,5.5013411984609597,5.173492760755579,5.0154121022351354,4.6119855532668748,4.261439636424293,3.7480708458881455,3.4818986953485491,3.3593505255650573,3.3108439439287105,3.4136394011835787,3.1017498290238121,3.0444043564398542]
["I15","Taxa de Mortalidade Infantil",{"$f":"Id!$D$40","v":"R02"},{"$f":"Id!$F$40","v":"Região de Saúde do Alentejo"},"I15R02",4.9566294919454768,4.5668617097188529,4.6037254763085205,4.3199654402764782,4.583818393480791,4.6449900464498999,4.8826701646990234,4.4659199062888932,3.7982376177453658,3.6563071297989032,3.8245585482952236,4.6625766871165641,4.0417104518632287,3.3406665037073249]
["I15","Taxa de Mortalidade Infantil",{"$f":"IF(AnACeS_Select=1,\"\",VLOOKUP(AnACeS_Select,AnACeS_tab,2,FALSE))","v":""},{"$f":"IF(AnACeS_Select=1,\"\",VLOOKUP(AnACeS_Select,AnACeS_tab,3,FALSE))","v":""},{"$f":"IF(C29=\"\",\"\",CONCATENATE(A29,C29))","v":""},{"$f":"IF(AnACeS_base!$C29=\"\",\"\",VLOOKUP($E29,BaseTrienal,F$13,FALSE))","v":""},{"$f":"IF(AnACeS_base!$C29=\"\",\"\",VLOOKUP($E29,BaseTrienal,G$13,FALSE))","v":""},{"$f":"IF(AnACeS_base!$C29=\"\",\"\",VLOOKUP($E29,BaseTrienal,H$13,FALSE))","v":""},{"$f":"IF(AnACeS_base!$C29=\"\",\"\",VLOOKUP($E29,BaseTrienal,I$13,FALSE))","v":""},{"$f":"IF(AnACeS_base!$C29=\"\",\"\",VLOOKUP($E29,BaseTrienal,J$13,FALSE))","v":""},{"$f":"IF(AnACeS_base!$C29=\"\",\"\",VLOOKUP($E29,BaseTrienal,K$13,FALSE))","v":""},{"$f":"IF(AnACeS_base!$C29=\"\",\"\",VLOOKUP($E29,BaseTrienal,L$13,FALSE))","v":""},{"$f":"IF(AnACeS_base!$C29=\"\",\"\",VLOOKUP($E29,BaseTrienal,M$13,FALSE))","v":""},{"$f":"IF(AnACeS_base!$C29=\"\",\"\",VLOOKUP($E29,BaseTrienal,N$13,FALSE))","v":""},{"$f":"IF(AnACeS_base!$C29=\"\",\"\",VLOOKUP($E29,BaseTrienal,O$13,FALSE))","v":""},{"$f":"IF(AnACeS_base!$C29=\"\",\"\",VLOOKUP($E29,BaseTrienal,P$13,FALSE))","v":""},{"$f":"IF(AnACeS_base!$C29=\"\",\"\",VLOOKUP($E29,BaseTrienal,Q$13,FALSE))","v":""},{"$f":"IF(AnACeS_base!$C29=\"\",\"\",VLOOKUP($E29,BaseTrienal,R$13,FALSE))","v":""},{"$f":"IF(AnACeS_base!$C29=\"\",\"\",VLOOKUP($E29,BaseTrienal,S$13,FALSE))","v":""}]
["I17","Taxa de Mortalidade Neonatal",{"$f":"Id!$D$39","v":"R01"},{"$f":"Id!$F$39","v":"Continente"},"I17R01",{"$f":"VLOOKUP($E30,BaseTrienal,F$13,FALSE)","v":3.8759689922480618},3.695700028213817,3.4440277221473741,3.1776121125956172,3.1433981017656079,2.9416988934350878,2.8325669666040354,2.4252223120452712,2.2483863178023902,2.1029267674916183,2.0798457870440825,2.177013220532817,2.0413520589677874,2.1264756855225992]
["I17","Taxa de Mortalidade Neonatal",{"$f":"Id!$D$40","v":"R02"},{"$f":"Id!$F$40","v":"Região de Saúde do Alentejo"},"I17R02",3.2801224579050952,3.1397174254317113,2.6205821942063885,2.5919792641658868,2.9103608847497093,3.1703900317039002,3.570908030899286,3.221319276667399,2.9626253418413855,2.3845481281297194,2.1970868256164051,2.6175869120654394,2.263357853043408,2.1999511121975068]
["I17","Taxa de Mortalidade Neonatal",{"$f":"IF(AnACeS_Select=1,\"\",VLOOKUP(AnACeS_Select,AnACeS_tab,2,FALSE))","v":""},{"$f":"IF(AnACeS_Select=1,\"\",VLOOKUP(AnACeS_Select,AnACeS_tab,3,FALSE))","v":""},{"$f":"IF(C32=\"\",\"\",CONCATENATE(A32,C32))","v":""},{"$f":"IF(AnACeS_base!$C32=\"\",\"\",VLOOKUP($E32,BaseTrienal,F$13,FALSE))","v":""},{"$f":"IF(AnACeS_base!$C32=\"\",\"\",VLOOKUP($E32,BaseTrienal,G$13,FALSE))","v":""},{"$f":"IF(AnACeS_base!$C32=\"\",\"\",VLOOKUP($E32,BaseTrienal,H$13,FALSE))","v":""},{"$f":"IF(AnACeS_base!$C32=\"\",\"\",VLOOKUP($E32,BaseTrienal,I$13,FALSE))","v":""},{"$f":"IF(AnACeS_base!$C32=\"\",\"\",VLOOKUP($E32,BaseTrienal,J$13,FALSE))","v":""},{"$f":"IF(AnACeS_base!$C32=\"\",\"\",VLOOKUP($E32,BaseTrienal,K$13,FALSE))","v":""},{"$f":"IF(AnACeS_base!$C32=\"\",\"\",VLOOKUP($E32,BaseTrienal,L$13,FALSE))","v":""},{"$f":"IF(AnACeS_base!$C32=\"\",\"\",VLOOKUP($E32,BaseTrienal,M$13,FALSE))","v":""},{"$f":"IF(AnACeS_base!$C32=\"\",\"\",VLOOKUP($E32,BaseTrienal,N$13,FALSE))","v":""},{"$f":"IF(AnACeS_base!$C32=\"\",\"\",VLOOKUP($E32,BaseTrienal,O$13,FALSE))","v":""},{"$f":"IF(AnACeS_base!$C32=\"\",\"\",VLOOKUP($E32,BaseTrienal,P$13,FALSE))","v":""},{"$f":"IF(AnACeS_base!$C32=\"\",\"\",VLOOKUP($E32,BaseTrienal,Q$13,FALSE))","v":""},{"$f":"IF(AnACeS_base!$C32=\"\",\"\",VLOOKUP($E32,BaseTrienal,R$13,FALSE))","v":""},{"$f":"IF(AnACeS_base!$C32=\"\",\"\",VLOOKUP($E32,BaseTrienal,S$13,FALSE))","v":""}]
["I19","Taxa de Mortalidade Neonatal Precoce",{"$f":"Id!$D$39","v":"R01"},{"$f":"Id!$F$39","v":"Continente"},"I19R01",{"$f":"VLOOKUP($E33,BaseTrienal,F$13,FALSE)","v":2.843850213367674},2.6787624365576663,2.5792278095376813,2.3573871886942626,2.3476397074292126,2.2093903765312257,2.0835103687687462,1.7510168998693127,1.5859444854164899,1.5530330802711474,1.5286021069006916,1.5466438861063843,1.3988960810185345,1.3999298263023776]
["I19","Taxa de Mortalidade Neonatal Precoce",{"$f":"Id!$D$40","v":"R02"},{"$f":"Id!$F$40","v":"Região de Saúde do Alentejo"},"I19R02",1.8222902543917197,1.7839303553589267,1.8414901905234082,1.8719850241198071,2.037252619324796,2.2856300228563002,2.6963999416994606,2.6356248627278718,2.4308720753570343,1.9076385025037754,1.8715924810806412,2.2085889570552149,1.9400210168943497,1.7925527580868574]
["I19","Taxa de Mortalidade Neonatal Precoce",{"$f":"IF(AnACeS_Select=1,\"\",VLOOKUP(AnACeS_Select,AnACeS_tab,2,FALSE))","v":""},{"$f":"IF(AnACeS_Select=1,\"\",VLOOKUP(AnACeS_Select,AnACeS_tab,3,FALSE))","v":""},{"$f":"IF(C35=\"\",\"\",CONCATENATE(A35,C35))","v":""},{"$f":"IF(AnACeS_base!$C35=\"\",\"\",VLOOKUP($E35,BaseTrienal,F$13,FALSE))","v":""},{"$f":"IF(AnACeS_base!$C35=\"\",\"\",VLOOKUP($E35,BaseTrienal,G$13,FALSE))","v":""},{"$f":"IF(AnACeS_base!$C35=\"\",\"\",VLOOKUP($E35,BaseTrienal,H$13,FALSE))","v":""},{"$f":"IF(AnACeS_base!$C35=\"\",\"\",VLOOKUP($E35,BaseTrienal,I$13,FALSE))","v":""},{"$f":"IF(AnACeS_base!$C35=\"\",\"\",VLOOKUP($E35,BaseTrienal,J$13,FALSE))","v":""},{"$f":"IF(AnACeS_base!$C35=\"\",\"\",VLOOKUP($E35,BaseTrienal,K$13,FALSE))","v":""},{"$f":"IF(AnACeS_base!$C35=\"\",\"\",VLOOKUP($E35,BaseTrienal,L$13,FALSE))","v":""},{"$f":"IF(AnACeS_base!$C35=\"\",\"\",VLOOKUP($E35,BaseTrienal,M$13,FALSE))","v":""},{"$f":"IF(AnACeS_base!$C35=\"\",\"\",VLOOKUP($E35,BaseTrienal,N$13,FALSE))","v":""},{"$f":"IF(AnACeS_base!$C35=\"\",\"\",VLOOKUP($E35,BaseTrienal,O$13,FALSE))","v":""},{"$f":"IF(AnACeS_base!$C35=\"\",\"\",VLOOKUP($E35,BaseTrienal,P$13,FALSE))","v":""},{"$f":"IF(AnACeS_base!$C35=\"\",\"\",VLOOKUP($E35,BaseTrienal,Q$13,FALSE))","v":""},{"$f":"IF(AnACeS_base!$C35=\"\",\"\",VLOOKUP($E35,BaseTrienal,R$13,FALSE))","v":""},{"$f":"IF(AnACeS_base!$C35=\"\",\"\",VLOOKUP($E35,BaseTrienal,S$13,FALSE))","v":""}]
["I21","Taxa de Mortalidade Pós-Neonatal",{"$f":"Id!$D$39","v":"R01"},{"$f":"Id!$F$39","v":"Continente"},"I21R01",{"$f":"VLOOKUP($E36,BaseTrienal,F$13,FALSE)","v":2.3451506199025327},2.1330886068885122,2.0573134763135856,1.995880648159962,1.872014000469528,1.6702866598317871,1.4288726698202578,1.322848533842875,1.2335123775461587,1.2564237580734392,1.2309981568846278,1.2366261806507617,1.0603977700560248,0.91792867091725527]
["I21","Taxa de Mortalidade Pós-Neonatal",{"$f":"Id!$D$40","v":"R02"},{"$f":"Id!$F$40","v":"Região de Saúde do Alentejo"},"I21R02",1.6765070340403818,1.4271442842871414,1.9831432821021318,1.727986176110591,1.6734575087310826,1.4746000147460001,1.3117621337997378,1.2446006296214949,0.83561227590398057,1.2717590016691835,1.6274717226788185,2.0449897750511248,1.7783525988198206,1.1407153915098183]
["I21","Taxa de Mortalidade Pós-Neonatal",{"$f":"IF(AnACeS_Select=1,\"\",VLOOKUP(AnACeS_Select,AnACeS_tab,2,FALSE))","v":""},{"$f":"IF(AnACeS_Select=1,\"\",VLOOKUP(AnACeS_Select,AnACeS_tab,3,FALSE))","v":""},{"$f":"IF(C38=\"\",\"\",CONCATENATE(A38,C38))","v":""},{"$f":"IF(AnACeS_base!$C38=\"\",\"\",VLOOKUP($E38,BaseTrienal,F$13,FALSE))","v":""},{"$f":"IF(AnACeS_base!$C38=\"\",\"\",VLOOKUP($E38,BaseTrienal,G$13,FALSE))","v":""},{"$f":"IF(AnACeS_base!$C38=\"\",\"\",VLOOKUP($E38,BaseTrienal,H$13,FALSE))","v":""},{"$f":"IF(AnACeS_base!$C38=\"\",\"\",VLOOKUP($E38,BaseTrienal,I$13,FALSE))","v":""},{"$f":"IF(AnACeS_base!$C38=\"\",\"\",VLOOKUP($E38,BaseTrienal,J$13,FALSE))","v":""},{"$f":"IF(AnACeS_base!$C38=\"\",\"\",VLOOKUP($E38,BaseTrienal,K$13,FALSE))","v":""},{"$f":"IF(AnACeS_base!$C38=\"\",\"\",VLOOKUP($E38,BaseTrienal,L$13,FALSE))","v":""},{"$f":"IF(AnACeS_base!$C38=\"\",\"\",VLOOKUP($E38,BaseTrienal,M$13,FALSE))","v":""},{"$f":"IF(AnACeS_base!$C38=\"\",\"\",VLOOKUP($E38,BaseTrienal,N$13,FALSE))","v":""},{"$f":"IF(AnACeS_base!$C38=\"\",\"\",VLOOKUP($E38,BaseTrienal,O$13,FALSE))","v":""},{"$f":"IF(AnACeS_base!$C38=\"\",\"\",VLOOKUP($E38,BaseTrienal,P$13,FALSE))","v":""},{"$f":"IF(AnACeS_base!$C38=\"\",\"\",VLOOKUP($E38,BaseTrienal,Q$13,FALSE))","v":""},{"$f":"IF(AnACeS_base!$C38=\"\",\"\",VLOOKUP($E38,BaseTrienal,R$13,FALSE))","v":""},{"$f":"IF(AnACeS_base!$C38=\"\",\"\",VLOOKUP($E38,BaseTrienal,S$13,FALSE))","v":""}]
["I23","Taxa de Mortalidade Fetal Tardia",{"$f":"Id!$D$39","v":"R01"},{"$f":"Id!$F$39","v":"Continente"},"I23R01",{"$f":"VLOOKUP($E39,BaseTrienal,F$13,FALSE)","v":0.42022749488466526},0.38513329874237145,0.37364869767104403,0.3553785053518671,0.34636874903153475,0.32087122906416182,0.29685043570489428,0.27594821350616744,0.27855697075802643,0.28446665824787148,0.27688219185473972,0.26967511877728956,0.25735458776756093,0.25029607763420714]
["I23","Taxa de Mortalidade Fetal Tardia",{"$f":"Id!$D$40","v":"R02"},{"$f":"Id!$F$40","v":"Região de Saúde do Alentejo"},"I23R02",0.37037037037037041,0.44753853804077576,0.49333991119881598,0.58693006942953263,0.54992764109985526,0.46965583033683134,0.39921608477897946,0.37925753045000365,0.35576413594731665,0.43526432415321298,0.36484514350575648,0.3829856584093872,0.3463831158369583,0.32485990416632826]
["I23","Taxa de Mortalidade Fetal Tardia",{"$f":"IF(AnACeS_Select=1,\"\",VLOOKUP(AnACeS_Select,AnACeS_tab,2,FALSE))","v":""},{"$f":"IF(AnACeS_Select=1,\"\",VLOOKUP(AnACeS_Select,AnACeS_tab,3,FALSE))","v":""},{"$f":"IF(C41=\"\",\"\",CONCATENATE(A41,C41))","v":""},{"$f":"IF(AnACeS_base!$C41=\"\",\"\",VLOOKUP($E41,BaseTrienal,F$13,FALSE))","v":""},{"$f":"IF(AnACeS_base!$C41=\"\",\"\",VLOOKUP($E41,BaseTrienal,G$13,FALSE))","v":""},{"$f":"IF(AnACeS_base!$C41=\"\",\"\",VLOOKUP($E41,BaseTrienal,H$13,FALSE))","v":""},{"$f":"IF(AnACeS_base!$C41=\"\",\"\",VLOOKUP($E41,BaseTrienal,I$13,FALSE))","v":""},{"$f":"IF(AnACeS_base!$C41=\"\",\"\",VLOOKUP($E41,BaseTrienal,J$13,FALSE))","v":""},{"$f":"IF(AnACeS_base!$C41=\"\",\"\",VLOOKUP($E41,BaseTrienal,K$13,FALSE))","v":""},{"$f":"IF(AnACeS_base!$C41=\"\",\"\",VLOOKUP($E41,BaseTrienal,L$13,FALSE))","v":""},{"$f":"IF(AnACeS_base!$C41=\"\",\"\",VLOOKUP($E41,BaseTrienal,M$13,FALSE))","v":""},{"$f":"IF(AnACeS_base!$C41=\"\",\"\",VLOOKUP($E41,BaseTrienal,N$13,FALSE))","v":""},{"$f":"IF(AnACeS_base!$C41=\"\",\"\",VLOOKUP($E41,BaseTrienal,O$13,FALSE))","v":""},{"$f":"IF(AnACeS_base!$C41=\"\",\"\",VLOOKUP($E41,BaseTrienal,P$13,FALSE))","v":""},{"$f":"IF(AnACeS_base!$C41=\"\",\"\",VLOOKUP($E41,BaseTrienal,Q$13,FALSE))","v":""},{"$f":"IF(AnACeS_base!$C41=\"\",\"\",VLOOKUP($E41,BaseTrienal,R$13,FALSE))","v":""},{"$f":"IF(AnACeS_base!$C41=\"\",\"\",VLOOKUP($E41,BaseTrienal,S$13,FALSE))","v":""}]
["I25","Taxa de Mortalidade Perinatal",{"$f":"Id!$D$39","v":"R01"},{"$f":"Id!$F$39","v":"Continente"},"I25R01",{"$f":"VLOOKUP($E42,BaseTrienal,F$13,FALSE)","v":7.0341745217044203},6.5197786178439951,6.3060775351278151,5.9027945948563953,5.8031957074581699,5.4110133691168434,5.0458298162100421,4.5056671350776067,4.3670964340802731,4.3932818014449309,4.2931915984297637,4.2392241601423608,3.968841835451542,3.8993866331995828]
["I25","Taxa de Mortalidade Perinatal",{"$f":"Id!$D$40","v":"R02"},{"$f":"Id!$F$40","v":"Região de Saúde do Alentejo"},"I25R02",5.5192447349310099,6.2513319599346451,6.7658044964409054,7.7302984754133561,7.5253256150506509,6.9714537315623391,6.67779632721202,6.4182043614616004,5.9798652637953227,6.2519784742006959,5.5132155018647646,6.0299869621903515,5.3971322700177211,5.0353285145780884]
["I25","Taxa de Mortalidade Perinatal",{"$f":"IF(AnACeS_Select=1,\"\",VLOOKUP(AnACeS_Select,AnACeS_tab,2,FALSE))","v":""},{"$f":"IF(AnACeS_Select=1,\"\",VLOOKUP(AnACeS_Select,AnACeS_tab,3,FALSE))","v":""},{"$f":"IF(C44=\"\",\"\",CONCATENATE(A44,C44))","v":""},{"$f":"IF(AnACeS_base!$C44=\"\",\"\",VLOOKUP($E44,BaseTrienal,F$13,FALSE))","v":""},{"$f":"IF(AnACeS_base!$C44=\"\",\"\",VLOOKUP($E44,BaseTrienal,G$13,FALSE))","v":""},{"$f":"IF(AnACeS_base!$C44=\"\",\"\",VLOOKUP($E44,BaseTrienal,H$13,FALSE))","v":""},{"$f":"IF(AnACeS_base!$C44=\"\",\"\",VLOOKUP($E44,BaseTrienal,I$13,FALSE))","v":""},{"$f":"IF(AnACeS_base!$C44=\"\",\"\",VLOOKUP($E44,BaseTrienal,J$13,FALSE))","v":""},{"$f":"IF(AnACeS_base!$C44=\"\",\"\",VLOOKUP($E44,BaseTrienal,K$13,FALSE))","v":""},{"$f":"IF(AnACeS_base!$C44=\"\",\"\",VLOOKUP($E44,BaseTrienal,L$13,FALSE))","v":""},{"$f":"IF(AnACeS_base!$C44=\"\",\"\",VLOOKUP($E44,BaseTrienal,M$13,FALSE))","v":""},{"$f":"IF(AnACeS_base!$C44=\"\",\"\",VLOOKUP($E44,BaseTrienal,N$13,FALSE))","v":""},{"$f":"IF(AnACeS_base!$C44=\"\",\"\",VLOOKUP($E44,BaseTrienal,O$13,FALSE))","v":""},{"$f":"IF(AnACeS_base!$C44=\"\",\"\",VLOOKUP($E44,BaseTrienal,P$13,FALSE))","v":""},{"$f":"IF(AnACeS_base!$C44=\"\",\"\",VLOOKUP($E44,BaseTrienal,Q$13,FALSE))","v":""},{"$f":"IF(AnACeS_base!$C44=\"\",\"\",VLOOKUP($E44,BaseTrienal,R$13,FALSE))","v":""},{"$f":"IF(AnACeS_base!$C44=\"\",\"\",VLOOKUP($E44,BaseTrienal,S$13,FALSE))","v":""}]

{"sheet":"AnIndT","index":9,"n_rows":65,"n_cols":17,"rows_kept":65,"cut":false,"hidden":false,"merged":[[67,1,67,16],[37,1,37,16],[59,6,59,16],[60,7,60,9],[61,7,61,9],[62,7,62,9],[63,7,63,9],[64,7,64,9],[11,6,11,7],[12,6,12,7],[13,6,13,7],[14,6,14,7],[58,6,58,7],[10,1,10,16],[1,1,1,16],[3,1,3,16],[5,1,5,5],[5,8,5,12],[8,1,8,16]]}
[]
[null,"mort@lidades.infantil"]
[]
[null,"Análise por Indicador"]
[]
[null,"Seleccione o Indicador",null,null,null,null,null,null,"Seleccione o ACeS"]
[]
[]
[null,{"$f":"IF(AnInd_baseT!E1=\"A\",\"\",AnInd_baseT!D1)","v":""}]
[]
[null,{"$f":"AnInd_baseT!B41","v":""}]
[null,null,"96-98","97-99","98-00","99-01","00-02",null,"01-03","02-04","03-05","04-06","05-07","06-08","07-09","08-10","09-11"]
[null,{"$f":"AnInd_baseT!B4","v":"Continente"},{"$f":"AnInd_baseT!F4","v":""},{"$f":"AnInd_baseT!G4","v":""},{"$f":"AnInd_baseT!H4","v":""},{"$f":"AnInd_baseT!I4","v":""},{"$f":"AnInd_baseT!J4","v":""},null,{"$f":"AnInd_baseT!K4","v":""},{"$f":"AnInd_baseT!L4","v":""},{"$f":"AnInd_baseT!M4","v":""},{"$f":"AnInd_baseT!N4","v":""},{"$f":"AnInd_baseT!O4","v":""},{"$f":"AnInd_baseT!P4","v":""},{"$f":"AnInd_baseT!Q4","v":""},{"$f":"AnInd_baseT!R4","v":""},{"$f":"AnInd_baseT!S4","v":""}]
[null,{"$f":"AnInd_baseT!B5","v":"Região de Saúde do Alentejo"},{"$f":"AnInd_baseT!F5","v":""},{"$f":"AnInd_baseT!G5","v":""},{"$f":"AnInd_baseT!H5","v":""},{"$f":"AnInd_baseT!I5","v":""},{"$f":"AnInd_baseT!J5","v":""},null,{"$f":"AnInd_baseT!K5","v":""},{"$f":"AnInd_baseT!L5","v":""},{"$f":"AnInd_baseT!M5","v":""},{"$f":"AnInd_baseT!N5","v":""},{"$f":"AnInd_baseT!O5","v":""},{"$f":"AnInd_baseT!P5","v":""},{"$f":"AnInd_baseT!Q5","v":""},{"$f":"AnInd_baseT!R5","v":""},{"$f":"AnInd_baseT!S5","v":""}]
[null,{"$f":"IF(AnInd_codACeS=\"\",\"\",AnInd_baseT!D12)","v":""},{"$f":"IF(AnInd_codACeS=\"\",\"\",AnInd_baseT!F12)","v":""},{"$f":"IF(AnInd_codACeS=\"\",\"\",AnInd_baseT!G12)","v":""},{"$f":"IF(AnInd_codACeS=\"\",\"\",AnInd_baseT!H12)","v":""},{"$f":"IF(AnInd_codACeS=\"\",\"\",AnInd_baseT!I12)","v":""},{"$f":"IF(AnInd_codACeS=\"\",\"\",AnInd_baseT!J12)","v":""},null,{"$f":"IF(AnInd_codACeS=\"\",\"\",AnInd_baseT!K12)","v":""},{"$f":"IF(AnInd_codACeS=\"\",\"\",AnInd_baseT!L12)","v":""},{"$f":"IF(AnInd_codACeS=\"\",\"\",AnInd_baseT!M12)","v":""},{"$f":"IF(AnInd_codACeS=\"\",\"\",AnInd_baseT!N12)","v":""},{"$f":"IF(AnInd_codACeS=\"\",\"\",AnInd_baseT!O12)","v":""},{"$f":"IF(AnInd_codACeS=\"\",\"\",AnInd_baseT!P12)","v":""},{"$f":"IF(AnInd_codACeS=\"\",\"\",AnInd_baseT!Q12)","v":""},{"$f":"IF(AnInd_codACeS=\"\",\"\",AnInd_baseT!R12)","v":""},{"$f":"IF(AnInd_codACeS=\"\",\"\",AnInd_baseT!S12)","v":""}]
[]
[]
[]
[]
[]
[]
[]
[]
[]
[]
[]
[]
[]
[]
[]
[]
[]
[]
[]
[]
[null,"Selecione o Triénio"]
[]
[null,{"$f":"AnInd_baseT!B42","v":""}]
[]
[]
[]
[]
[]
[]
[]
[]
[]
[]
[]
[]
[]
[]
[]
[]
[]
[]
[]
[]
[null,null,null,null,null,null,"Legenda"]
[null,null,null,null,null,null,{"$f":"AnInd_baseT!B43","v":""}]
[null,null,null,null,null,null,null,{"$f":"AnInd_baseT!J33","v":""}]
[null,null,null,null,null,null,null,{"$f":"AnInd_baseT!J34","v":""}]
[null,null,null,null,null,null,null,{"$f":"AnInd_baseT!J35","v":""}]
[null,null,null,null,null,null,null,{"$f":"AnInd_baseT!J36","v":""}]
[null,null,null,null,null,null,null,{"$f":"AnInd_baseT!J37","v":""}]

{"sheet":"AnIndA","index":10,"n_rows":65,"n_cols":19,"rows_kept":65,"cut":false,"hidden":false,"merged":[[67,1,67,18],[37,1,37,18],[59,7,59,18],[58,7,58,8],[60,8,60,10],[61,8,61,10],[62,8,62,10],[63,8,63,10],[64,8,64,10],[14,7,14,8],[11,7,11,8],[5,9,5,14],[8,1,8,18],[10,1,10,18],[1,1,1,18],[3,1,3,18],[5,1,5,6],[12,7,12,8],[13,7,13,8]]}
[]
[null,"mort@lidades.infantil"]
[]
[null,"Análise por Indicador"]
[]
[null,"Selecione o Indicador",null,null,null,null,null,null,null,"Selecione o ACeS"]
[]
[]
[null,{"$f":"IF(AnInd_baseT!E1=\"T\",\"\",AnInd_baseT!D1)","v":""}]
[]
[null,{"$f":"AnInd_baseA!B41","v":""}]
[null,null,1996,1997,1998,1999,2000,2001,null,2002,2003,2004,2005,2006,2007,2008,2009,2010,2011]
[null,{"$f":"AnInd_baseA!B4","v":"Continente"},{"$f":"AnInd_baseA!F4","v":""},{"$f":"AnInd_baseA!G4","v":""},{"$f":"AnInd_baseA!H4","v":""},{"$f":"AnInd_baseA!I4","v":""},{"$f":"AnInd_baseA!J4","v":""},{"$f":"AnInd_baseA!K4","v":""},null,{"$f":"AnInd_baseA!L4","v":""},{"$f":"AnInd_baseA!M4","v":""},{"$f":"AnInd_baseA!N4","v":""},{"$f":"AnInd_baseA!O4","v":""},{"$f":"AnInd_baseA!P4","v":""},{"$f":"AnInd_baseA!Q4","v":""},{"$f":"AnInd_baseA!R4","v":""},{"$f":"AnInd_baseA!S4","v":""},{"$f":"AnInd_baseA!T4","v":""},{"$f":"AnInd_baseA!U4","v":""}]
[null,{"$f":"AnInd_baseA!B5","v":"Região de Saúde do Alentejo"},{"$f":"AnInd_baseA!F5","v":""},{"$f":"AnInd_baseA!G5","v":""},{"$f":"AnInd_baseA!H5","v":""},{"$f":"AnInd_baseA!I5","v":""},{"$f":"AnInd_baseA!J5","v":""},{"$f":"AnInd_baseA!K5","v":""},null,{"$f":"AnInd_baseA!L5","v":""},{"$f":"AnInd_baseA!M5","v":""},{"$f":"AnInd_baseA!N5","v":""},{"$f":"AnInd_baseA!O5","v":""},{"$f":"AnInd_baseA!P5","v":""},{"$f":"AnInd_baseA!Q5","v":""},{"$f":"AnInd_baseA!R5","v":""},{"$f":"AnInd_baseA!S5","v":""},{"$f":"AnInd_baseA!T5","v":""},{"$f":"AnInd_baseA!U5","v":""}]
[null,{"$f":"AnInd_baseA!D12","v":""},{"$f":"AnInd_baseA!F12","v":""},{"$f":"AnInd_baseA!G12","v":""},{"$f":"AnInd_baseA!H12","v":""},{"$f":"AnInd_baseA!I12","v":""},{"$f":"AnInd_baseA!J12","v":""},{"$f":"AnInd_baseA!K12","v":""},null,{"$f":"AnInd_baseA!L12","v":""},{"$f":"AnInd_baseA!M12","v":""},{"$f":"AnInd_baseA!N12","v":""},{"$f":"AnInd_baseA!O12","v":""},{"$f":"AnInd_baseA!P12","v":""},{"$f":"AnInd_baseA!Q12","v":""},{"$f":"AnInd_baseA!R12","v":""},{"$f":"AnInd_baseA!S12","v":""},{"$f":"AnInd_baseA!T12","v":""},{"$f":"AnInd_baseA!U12","v":""}]
[]
[]
[]
[]
[]
[]
[]
[]
[]
[]
[]
[]
[]
[]
[]
[]
[]
[]
[]
[]
[null,"Selecione o Ano"]
[]
[null,{"$f":"AnInd_baseA!B42","v":""}]
[]
[]
[]
[]
[]
[]
[]
[]
[]
[]
[]
[]
[]
[]
[]
[]
[]
[]
[]
[]
[null,null,null,null,null,null,null,"Legenda"]
[null,null,null,null,null,null,null,{"$f":"AnInd_baseA!B42","v":""}]
[null,null,null,null,null,null,null,null,{"$f":"AnInd_baseA!K34","v":""}]
[null,null,null,null,null,null,null,null,{"$f":"AnInd_baseA!K35","v":""}]
[null,null,null,null,null,null,null,null,{"$f":"AnInd_baseA!K36","v":""}]
[null,null,null,null,null,null,null,null,{"$f":"AnInd_baseA!K37","v":""}]
[null,null,null,null,null,null,null,null,{"$f":"AnInd_baseA!K38","v":""}]

{"sheet":"AnInd_baseT","index":11,"n_rows":43,"n_cols":19,"rows_kept":43,"cut":false,"hidden":true,"merged":[]}
[1,"AnInd_Select",{"$f":"IF(AnInd_Select=1,\"\",VLOOKUP(AnInd_Select,AnInd_tab,3,FALSE))","v":""},{"$f":"IF(AnInd_Select=1,\"\",VLOOKUP(AnInd_Select,AnInd_tab,4,FALSE))","v":""},{"$f":"IF(AnInd_Select=1,\"\",VLOOKUP(AnInd_Select,AnInd_tab,2,FALSE))","v":""}]
[null,null,null,{"$f":"IF(AnInd_Select=1,\"\",VLOOKUP(AnInd_Select,AnInd_tabLeg,5,FALSE))","v":""},{"$f":"IF(AnInd_Select=1,\"\",VLOOKUP(AnInd_Select,AnInd_tabLeg,6,FALSE))","v":""},{"$f":"IF(AnInd_Select=1,\"\",VLOOKUP(AnInd_Select,AnInd_tabLeg,7,FALSE))","v":""}]
["Rcod","Local_Residencia","Icod","Indicador","cod_IndRes","96-98","97-99","98-00","99-01","00-02","01-03","02-04","03-05","04-06","05-07","06-08","07-09","08-10","09-11"]
[{"$f":"Id!D39","v":"R01"},{"$f":"Id!F39","v":"Continente"},{"$f":"IF(TipoAn=\"T\",$C$1,\"\")","v":""},{"$f":"IF(TipoAn=\"T\",$D$1,\"\")","v":""},{"$f":"IF(C4=\"\",\"\",CONCATENATE(C4,A4))","v":""},{"$f":"IF(C4=\"\",\"\",VLOOKUP($E4,BaseTrienal,18,FALSE))","v":""},{"$f":"IF(C4=\"\",\"\",VLOOKUP($E4,BaseTrienal,19,FALSE))","v":""},{"$f":"IF(C4=\"\",\"\",VLOOKUP($E4,BaseTrienal,20,FALSE))","v":""},{"$f":"IF(C4=\"\",\"\",VLOOKUP($E4,BaseTrienal,21,FALSE))","v":""},{"$f":"IF(C4=\"\",\"\",VLOOKUP($E4,BaseTrienal,22,FALSE))","v":""},{"$f":"IF(C4=\"\",\"\",VLOOKUP($E4,BaseTrienal,23,FALSE))","v":""},{"$f":"IF(C4=\"\",\"\",VLOOKUP($E4,BaseTrienal,24,FALSE))","v":""},{"$f":"IF(C4=\"\",\"\",VLOOKUP($E4,BaseTrienal,25,FALSE))","v":""},{"$f":"IF(C4=\"\",\"\",VLOOKUP($E4,BaseTrienal,26,FALSE))","v":""},{"$f":"IF(C4=\"\",\"\",VLOOKUP($E4,BaseTrienal,27,FALSE))","v":""},{"$f":"IF(C4=\"\",\"\",VLOOKUP($E4,BaseTrienal,28,FALSE))","v":""},{"$f":"IF(C4=\"\",\"\",VLOOKUP($E4,BaseTrienal,29,FALSE))","v":""},{"$f":"IF(C4=\"\",\"\",VLOOKUP($E4,BaseTrienal,30,FALSE))","v":""},{"$f":"IF(C4=\"\",\"\",VLOOKUP($E4,BaseTrienal,31,FALSE))","v":""}]
[{"$f":"Id!D40","v":"R02"},{"$f":"Id!F40","v":"Região de Saúde do Alentejo"},"","",{"$f":"IF(C5=\"\",\"\",CONCATENATE(C5,A5))","v":""},"","","","","","","","","","","","","",""]
[{"$f":"Id!D41","v":"R03"},{"$f":"Id!F41","v":"ACES Alentejo Litoral"},"","","","","","","","","","","","","","","","",""]
[{"$f":"Id!D42","v":"R04"},{"$f":"Id!F42","v":"ACES Alentejo Central I"},"","","","","","","","","","","","","","","","",""]
[{"$f":"Id!D43","v":"R05"},{"$f":"Id!F43","v":"ACES Alentejo Central II"},"","","","","","","","","","","","","","","","",""]
[{"$f":"Id!D44","v":"R06"},{"$f":"Id!F44","v":"ULS Norte Alentejano"},"","","","","","","","","","","","","","","","",""]
[{"$f":"Id!D45","v":"R07"},{"$f":"Id!F45","v":"ULS Baixo Alentejo"},"","","","","","","","","","","","","","","","",""]
[]
[1,"AnInd_ACeS",{"$f":"IF(AnInd_ACeS=1,\"\",VLOOKUP(AnInd_ACeS,AnACeS_tab,2,FALSE))","v":""},{"$f":"IF(AnInd_ACeS=1,\"\",VLOOKUP(AnInd_ACeS,AnACeS_tab,3,FALSE))","v":""},{"$f":"IF(AnInd_codACeS=\"\",\"\",VLOOKUP(AnInd_codACeS,AnInd_TabTrienios,5,FALSE))","v":""},{"$f":"IF(AnInd_codACeS=\"\",\"\",VLOOKUP(AnInd_codACeS,AnInd_TabTrienios,6,FALSE))","v":""},{"$f":"IF(AnInd_codACeS=\"\",\"\",VLOOKUP(AnInd_codACeS,AnInd_TabTrienios,7,FALSE))","v":""},{"$f":"IF(AnInd_codACeS=\"\",\"\",VLOOKUP(AnInd_codACeS,AnInd_TabTrienios,8,FALSE))","v":""},{"$f":"IF(AnInd_codACeS=\"\",\"\",VLOOKUP(AnInd_codACeS,AnInd_TabTrienios,9,FALSE))","v":""},{"$f":"IF(AnInd_codACeS=\"\",\"\",VLOOKUP(AnInd_codACeS,AnInd_TabTrienios,10,FALSE))","v":""},{"$f":"IF(AnInd_codACeS=\"\",\"\",VLOOKUP(AnInd_codACeS,AnInd_TabTrienios,11,FALSE))","v":""},{"$f":"IF(AnInd_codACeS=\"\",\"\",VLOOKUP(AnInd_codACeS,AnInd_TabTrienios,12,FALSE))","v":""},{"$f":"IF(AnInd_codACeS=\"\",\"\",VLOOKUP(AnInd_codACeS,AnInd_TabTrienios,13,FALSE))","v":""},{"$f":"IF(AnInd_codACeS=\"\",\"\",VLOOKUP(AnInd_codACeS,AnInd_TabTrienios,14,FALSE))","v":""},{"$f":"IF(AnInd_codACeS=\"\",\"\",VLOOKUP(AnInd_codACeS,AnInd_TabTrienios,15,FALSE))","v":""},{"$f":"IF(AnInd_codACeS=\"\",\"\",VLOOKUP(AnInd_codACeS,AnInd_TabTrienios,16,FALSE))","v":""},{"$f":"IF(AnInd_codACeS=\"\",\"\",VLOOKUP(AnInd_codACeS,AnInd_TabTrienios,17,FALSE))","v":""},{"$f":"IF(AnInd_codACeS=\"\",\"\",VLOOKUP(AnInd_codACeS,AnInd_TabTrienios,18,FALSE))","v":""},{"$f":"IF(AnInd_codACeS=\"\",\"\",VLOOKUP(AnInd_codACeS,AnInd_TabTrienios,19,FALSE))","v":""}]
[]
[14,"AnInd_Trienio",{"$f":"VLOOKUP(AnInd_TrienioSelect,AnIdTrienios,3,FALSE)","v":"2009-2011"},{"$f":"VLOOKUP(AnInd_TrienioSelect,AnIdTrienios,4,FALSE)","v":"09-11"}]
[]
[1,{"$f":"IF(E16=\"\",\"\",IF(E16<>0,RANK(E16,$E$16:$E$22,0),RANK(E16,$E$16:$E$22,0)+COUNTIF($E15:E$16,0)))","v":""},{"$f":"Id!E39","v":"CT"},{"$f":"Id!F39","v":"Continente"},{"$f":"IF(OR($D$14=\"\",HLOOKUP($D$14,$F$3:$S$10,A16+1,FALSE)=\"na\"),\"\",HLOOKUP($D$14,$F$3:$S$10,A16+1,FALSE))","v":""},null,"OrdCT",{"$f":"IF(B16=\"\",\"\",B16)","v":""}]
[2,{"$f":"IF(E17=\"\",\"\",IF(E17<>0,RANK(E17,$E$16:$E$22,0),RANK(E17,$E$16:$E$22,0)+COUNTIF($E$16:E16,0)))","v":""},{"$f":"Id!E40","v":"RA"},{"$f":"Id!F40","v":"Região de Saúde do Alentejo"},"",null,"OrdRN",{"$f":"IF(B17=\"\",\"\",B17)","v":""}]
[3,{"$f":"IF(E18=\"\",\"\",IF(E18<>0,RANK(E18,$E$16:$E$22,0),RANK(E18,$E$16:$E$22,0)+COUNTIF($E$16:E17,0)))","v":""},{"$f":"Id!E41","v":"A401"},{"$f":"Id!F41","v":"ACES Alentejo Litoral"},"",null,"OrdACeS",{"$f":"VLOOKUP(AnInd_ACeS+1,A16:B22,2,FALSE)","v":""},null,null,{"$f":"IF($B18=\"\",\"\",IF(AND($B18<$B$16,$B18<$B$17),$B18,IF(AND($B18<$B$16,$B18>$B$17),$B18-1,IF(AND($B18<$B$17,$B18>$B$16),$B18-1,$B18-2))))","v":""},{"$f":"IF(K18=\"\",\"\",RANK(E18,$E$18:$E$22,1))","v":""}]
[4,{"$f":"IF(E19=\"\",\"\",IF(E19<>0,RANK(E19,$E$16:$E$22,0),RANK(E19,$E$16:$E$22,0)+COUNTIF($E$16:E18,0)))","v":""},{"$f":"Id!E42","v":"A402"},{"$f":"Id!F42","v":"ACES Alentejo Central I"},"",null,null,null,null,null,{"$f":"IF($B19=\"\",\"\",IF(AND($B19<$B$16,$B19<$B$17),$B19,IF(AND($B19<$B$16,$B19>$B$17),$B19-1,IF(AND($B19<$B$17,$B19>$B$16),$B19-1,$B19-2))))","v":""},{"$f":"IF(K19=\"\",\"\",RANK(E19,$E$18:$E$22,1))","v":""}]
[5,{"$f":"IF(E20=\"\",\"\",IF(E20<>0,RANK(E20,$E$16:$E$22,0),RANK(E20,$E$16:$E$22,0)+COUNTIF($E$16:E19,0)))","v":""},{"$f":"Id!E43","v":"A403"},{"$f":"Id!F43","v":"ACES Alentejo Central II"},"",null,"Zeros",{"$f":"COUNTIF(E16:E22,0)","v":0},null,null,"",""]
[6,{"$f":"IF(E21=\"\",\"\",IF(E21<>0,RANK(E21,$E$16:$E$22,0),RANK(E21,$E$16:$E$22,0)+COUNTIF($E$16:E20,0)))","v":""},{"$f":"Id!E44","v":"A904"},{"$f":"Id!F44","v":"ULS Norte Alentejano"},"",null,null,null,null,null,"",""]
[7,{"$f":"IF(E22=\"\",\"\",IF(E22<>0,RANK(E22,$E$16:$E$22,0),RANK(E22,$E$16:$E$22,0)+COUNTIF($E$16:E21,0)))","v":""},{"$f":"Id!E45","v":"A905"},{"$f":"Id!F45","v":"ULS Baixo Alentejo"},"",null,null,null,null,null,"",""]
[]
[{"$f":"IF(E16=\"\",\"\",VLOOKUP($A16,$B$16:$E$22,2,FALSE))","v":""},{"$f":"IF(E16=\"\",\"\",VLOOKUP($A16,$B$16:$E$22,3,FALSE))","v":""},{"$f":"IF(E16=\"\",\"\",VLOOKUP($A16,$B$16:$E$22,4,FALSE))","v":""},{"$f":"IF(A24=\"\",\"\",CONCATENATE(B24,\" (\",A24,\")\"))","v":""}]
["","","",{"$f":"IF(A25=\"\",\"\",CONCATENATE(B25,\" (\",A25,\")\"))","v":""}]
["","","",""]
["","","",""]
["","","",""]
["","","",""]
["","","",""]
[]
["Ord","Nº","ACeS",null,null,null,0,0,"classe0"]
[{"$f":"IF(D33=\"\",\"\",RANK(D33,$D$33:$D$37,1))","v":""},2,{"$f":"C18","v":"A401"},{"$f":"IF(E18=\"\",\"\",E18)","v":""},null,null,{"$f":"IF($D$33=\"\",\"\",VLOOKUP(1,$A$33:$D$37,4,FALSE))","v":""},null,"classe1",{"$f":"IF(G33=\"\",\"\",ROUND(G33,2))","v":""},null,"ACeS Activo","A905","ACeSAct"]
[{"$f":"IF(D34=\"\",\"\",RANK(D34,$D$33:$D$37,1))","v":""},3,{"$f":"C19","v":"A402"},{"$f":"IF(E19=\"\",\"\",E19)","v":""},null,null,{"$f":"IF($D$33=\"\",\"\",VLOOKUP(2,$A$33:$D$37,4,FALSE))","v":""},null,"classe2",{"$f":"IF(G34=\"\",\"\",ROUND(G34,2))","v":""},null,"Valor",{"$f":"IF(D33=\"\",0,VLOOKUP(ACeSAct,DadosMapear,2,FALSE))","v":0},"ACeSActValor"]
[{"$f":"IF(D35=\"\",\"\",RANK(D35,$D$33:$D$37,1))","v":""},4,"A403",{"$f":"IF(E20=\"\",\"\",E20)","v":""},null,null,{"$f":"IF($D$33=\"\",\"\",VLOOKUP(3,$A$33:$D$37,4,FALSE))","v":""},null,"classe3","",null,"Código",{"$f":"VLOOKUP(ACeSActValor,classeValores,3,TRUE)","v":"classe0"},"ACeSActCod"]
[{"$f":"IF(D36=\"\",\"\",RANK(D36,$D$33:$D$37,1))","v":""},5,"A904",{"$f":"IF(E21=\"\",\"\",E21)","v":""},null,null,{"$f":"IF($D$33=\"\",\"\",VLOOKUP(4,$A$33:$D$37,4,FALSE))","v":""},null,"classe4",""]
[{"$f":"IF(D37=\"\",\"\",RANK(D37,$D$33:$D$37,1))","v":""},6,"A905",{"$f":"IF(E22=\"\",\"\",E22)","v":""},null,null,{"$f":"IF($D$33=\"\",\"\",VLOOKUP(5,$A$33:$D$37,4,FALSE))","v":""},null,"classe5",""]
[null,"ACeS_Select",{"$f":"IF(AnInd_codACeS=\"\",\"\",VLOOKUP(AnInd_codACeS,Id!$D$39:$G$45,2,FALSE))","v":""}]
[]
[null,"Legenda"]
[null,{"$f":"IF(TipoAn=\"T\",D2 & \" \" & E2 & \", 1996-2011 \" & F2,\"\")","v":""}]
[null,{"$f":"IF(TipoAn=\"T\",D2 & \" \" & E2 & \", MÉDIA ANUAL NO TRIÉNIO \" & C14,\"\")","v":""}]
[null,{"$f":"IF(TipoAn=\"T\",D2 & \" \" & E2 & \", \" & C14,\"\")","v":""}]

{"sheet":"AnInd_baseA","index":12,"n_rows":42,"n_cols":21,"rows_kept":42,"cut":false,"hidden":true,"merged":[]}
[]
[]
["Rcod","Local_Residencia","Icod","Indicador","cod_IndRes",1996,1997,1998,1999,2000,2001,2002,2003,2004,2005,2006,2007,2008,2009,2010,2011]
[{"$f":"Id!D39","v":"R01"},{"$f":"Id!F39","v":"Continente"},{"$f":"IF(TipoAn=\"A\",AnInd_baseT!$C$1,\"\")","v":""},{"$f":"IF(TipoAn=\"A\",AnInd_baseT!$D$1,\"\")","v":""},{"$f":"IF(C4=\"\",\"\",CONCATENATE(C4,A4))","v":""},{"$f":"IF(C4=\"\",\"\",VLOOKUP($E4,BaseAnual,2,FALSE))","v":""},{"$f":"IF(C4=\"\",\"\",VLOOKUP($E4,BaseAnual,3,FALSE))","v":""},{"$f":"IF(C4=\"\",\"\",VLOOKUP($E4,BaseAnual,4,FALSE))","v":""},{"$f":"IF(C4=\"\",\"\",VLOOKUP($E4,BaseAnual,5,FALSE))","v":""},{"$f":"IF(C4=\"\",\"\",VLOOKUP($E4,BaseAnual,6,FALSE))","v":""},{"$f":"IF(C4=\"\",\"\",VLOOKUP($E4,BaseAnual,7,FALSE))","v":""},{"$f":"IF(C4=\"\",\"\",VLOOKUP($E4,BaseAnual,8,FALSE))","v":""},{"$f":"IF(C4=\"\",\"\",VLOOKUP($E4,BaseAnual,9,FALSE))","v":""},{"$f":"IF(C4=\"\",\"\",VLOOKUP($E4,BaseAnual,10,FALSE))","v":""},{"$f":"IF(C4=\"\",\"\",VLOOKUP($E4,BaseAnual,11,FALSE))","v":""},{"$f":"IF(C4=\"\",\"\",VLOOKUP($E4,BaseAnual,12,FALSE))","v":""},{"$f":"IF(C4=\"\",\"\",VLOOKUP($E4,BaseAnual,13,FALSE))","v":""},{"$f":"IF(C4=\"\",\"\",VLOOKUP($E4,BaseAnual,14,FALSE))","v":""},{"$f":"IF(C4=\"\",\"\",VLOOKUP($E4,BaseAnual,15,FALSE))","v":""},{"$f":"IF(C4=\"\",\"\",VLOOKUP($E4,BaseAnual,16,FALSE))","v":""},{"$f":"IF(C4=\"\",\"\",VLOOKUP($E4,BaseAnual,17,FALSE))","v":""}]
[{"$f":"Id!D40","v":"R02"},{"$f":"Id!F40","v":"Região de Saúde do Alentejo"},{"$f":"IF(TipoAn=\"A\",AnInd_baseT!$C$1,\"\")","v":""},{"$f":"IF(TipoAn=\"A\",AnInd_baseT!$D$1,\"\")","v":""},{"$f":"IF(C5=\"\",\"\",CONCATENATE(C5,A5))","v":""},"","","","","","","","","","","","","","","",""]
[{"$f":"Id!D41","v":"R03"},{"$f":"Id!F41","v":"ACES Alentejo Litoral"},{"$f":"IF(TipoAn=\"A\",AnInd_baseT!$C$1,\"\")","v":""},{"$f":"IF(TipoAn=\"A\",AnInd_baseT!$D$1,\"\")","v":""},"","","","","","","","","","","","","","","","",""]
[{"$f":"Id!D42","v":"R04"},{"$f":"Id!F42","v":"ACES Alentejo Central I"},{"$f":"IF(TipoAn=\"A\",AnInd_baseT!$C$1,\"\")","v":""},{"$f":"IF(TipoAn=\"A\",AnInd_baseT!$D$1,\"\")","v":""},"","","","","","","","","","","","","","","","",""]
[{"$f":"Id!D43","v":"R05"},{"$f":"Id!F43","v":"ACES Alentejo Central II"},{"$f":"IF(TipoAn=\"A\",AnInd_baseT!$C$1,\"\")","v":""},{"$f":"IF(TipoAn=\"A\",AnInd_baseT!$D$1,\"\")","v":""},"","","","","","","","","","","","","","","","",""]
[{"$f":"Id!D44","v":"R06"},{"$f":"Id!F44","v":"ULS Norte Alentejano"},{"$f":"IF(TipoAn=\"A\",AnInd_baseT!$C$1,\"\")","v":""},{"$f":"IF(TipoAn=\"A\",AnInd_baseT!$D$1,\"\")","v":""},"","","","","","","","","","","","","","","","",""]
[{"$f":"Id!D45","v":"R07"},{"$f":"Id!F45","v":"ULS Baixo Alentejo"},{"$f":"IF(TipoAn=\"A\",AnInd_baseT!$C$1,\"\")","v":""},{"$f":"IF(TipoAn=\"A\",AnInd_baseT!$D$1,\"\")","v":""},"","","","","","","","","","","","","","","","",""]
[]
[{"$f":"AnInd_ACeS","v":1},{"$f":"AnInd_baseT!B12","v":"AnInd_ACeS"},{"$f":"AnInd_codACeS","v":""},{"$f":"AnInd_baseT!D12","v":""},{"$f":"IF(AnInd_codACeS=\"\",\"\",VLOOKUP(AnInd_codACeS,AnInd_TabAnual,5,FALSE))","v":""},{"$f":"IF(AnInd_codACeS=\"\",\"\",VLOOKUP(AnInd_codACeS,AnInd_TabAnual,6,FALSE))","v":""},{"$f":"IF(AnInd_codACeS=\"\",\"\",VLOOKUP(AnInd_codACeS,AnInd_TabAnual,7,FALSE))","v":""},{"$f":"IF(AnInd_codACeS=\"\",\"\",VLOOKUP(AnInd_codACeS,AnInd_TabAnual,8,FALSE))","v":""},{"$f":"IF(AnInd_codACeS=\"\",\"\",VLOOKUP(AnInd_codACeS,AnInd_TabAnual,9,FALSE))","v":""},{"$f":"IF(AnInd_codACeS=\"\",\"\",VLOOKUP(AnInd_codACeS,AnInd_TabAnual,10,FALSE))","v":""},{"$f":"IF(AnInd_codACeS=\"\",\"\",VLOOKUP(AnInd_codACeS,AnInd_TabAnual,11,FALSE))","v":""},{"$f":"IF(AnInd_codACeS=\"\",\"\",VLOOKUP(AnInd_codACeS,AnInd_TabAnual,12,FALSE))","v":""},{"$f":"IF(AnInd_codACeS=\"\",\"\",VLOOKUP(AnInd_codACeS,AnInd_TabAnual,13,FALSE))","v":""},{"$f":"IF(AnInd_codACeS=\"\",\"\",VLOOKUP(AnInd_codACeS,AnInd_TabAnual,14,FALSE))","v":""},{"$f":"IF(AnInd_codACeS=\"\",\"\",VLOOKUP(AnInd_codACeS,AnInd_TabAnual,15,FALSE))","v":""},{"$f":"IF(AnInd_codACeS=\"\",\"\",VLOOKUP(AnInd_codACeS,AnInd_TabAnual,16,FALSE))","v":""},{"$f":"IF(AnInd_codACeS=\"\",\"\",VLOOKUP(AnInd_codACeS,AnInd_TabAnual,17,FALSE))","v":""},{"$f":"IF(AnInd_codACeS=\"\",\"\",VLOOKUP(AnInd_codACeS,AnInd_TabAnual,18,FALSE))","v":""},{"$f":"IF(AnInd_codACeS=\"\",\"\",VLOOKUP(AnInd_codACeS,AnInd_TabAnual,19,FALSE))","v":""},{"$f":"IF(AnInd_codACeS=\"\",\"\",VLOOKUP(AnInd_codACeS,AnInd_TabAnual,20,FALSE))","v":""},{"$f":"IF(AnInd_codACeS=\"\",\"\",VLOOKUP(AnInd_codACeS,AnInd_TabAnual,21,FALSE))","v":""}]
[]
[16,"AnInd_Ano",{"$f":"VLOOKUP(AnInd_AnoSelect,AnIdAnos,4,FALSE)","v":2011},{"$f":"VLOOKUP(AnInd_AnoSelect,AnIdAnos,5,FALSE)","v":"11"}]
[]
[1,{"$f":"IF(E16=\"\",\"\",RANK(E16,$E$16:$E$22,0))","v":""},{"$f":"Id!E39","v":"CT"},{"$f":"Id!F39","v":"Continente"},{"$f":"IF($C$4=\"\",\"\",HLOOKUP($C$14,$F$3:$U$10,A16+1,FALSE))","v":""},null,"OrdCTA",{"$f":"IF(B16=\"\",\"\",B16)","v":""}]
[2,"",{"$f":"Id!E40","v":"RA"},{"$f":"Id!F40","v":"Região de Saúde do Alentejo"},"",null,"OrdRNA",{"$f":"IF(B17=\"\",\"\",B17)","v":""}]
[3,"",{"$f":"Id!E41","v":"A401"},{"$f":"Id!F41","v":"ACES Alentejo Litoral"},"",null,"OrdACeSA",{"$f":"VLOOKUP(AnInd_ACeS+1,A16:B22,2,FALSE)","v":""},null,null,{"$f":"IF($B18=\"\",\"\",IF(AND($B18<$B$16,$B18<$B$17),$B18,IF(AND($B18<$B$16,$B18>$B$17),$B18-1,IF(AND($B18<$B$17,$B18>$B$16),$B18-1,$B18-2))))","v":""},{"$f":"IF(K18=\"\",\"\",RANK(E18,$E$18:$E$22,1))","v":""}]
[4,"",{"$f":"Id!E42","v":"A402"},{"$f":"Id!F42","v":"ACES Alentejo Central I"},"",null,null,null,null,null,{"$f":"IF($B19=\"\",\"\",IF(AND($B19<$B$16,$B19<$B$17),$B19,IF(AND($B19<$B$16,$B19>$B$17),$B19-1,IF(AND($B19<$B$17,$B19>$B$16),$B19-1,$B19-2))))","v":""},{"$f":"IF(K19=\"\",\"\",RANK(E19,$E$18:$E$22,1))","v":""}]
[5,"",{"$f":"Id!E43","v":"A403"},{"$f":"Id!F43","v":"ACES Alentejo Central II"},"",null,null,null,null,null,"",""]
[6,"",{"$f":"Id!E44","v":"A904"},{"$f":"Id!F44","v":"ULS Norte Alentejano"},"",null,null,null,null,null,"",""]
[7,"",{"$f":"Id!E45","v":"A905"},{"$f":"Id!F45","v":"ULS Baixo Alentejo"},"",null,null,null,null,null,"",""]
[]
[{"$f":"IF(E16=\"\",\"\",VLOOKUP($A16,$B$16:$E$22,2,FALSE))","v":""},{"$f":"IF(E16=\"\",\"\",VLOOKUP($A16,$B$16:$E$22,3,FALSE))","v":""},{"$f":"IF(E16=\"\",\"\",VLOOKUP($A16,$B$16:$E$22,4,FALSE))","v":""},{"$f":"IF(A24=\"\",\"\",CONCATENATE(B24,\" (\",A24,\")\"))","v":""}]
["","","",{"$f":"IF(A25=\"\",\"\",CONCATENATE(B25,\" (\",A25,\")\"))","v":""}]
["","","",""]
["","","",""]
["","","",""]
["","","",""]
["","","",""]
[]
["Ord","Nº","ACeS"]
[{"$f":"IF(D33=\"\",\"\",RANK(D33,$D$33:$D$37,1))","v":""},2,{"$f":"C18","v":"A401"},{"$f":"IF(E18=\"\",\"\",E18)","v":""},null,null,0,0,"classeA0"]
[{"$f":"IF(D34=\"\",\"\",RANK(D34,$D$33:$D$37,1))","v":""},3,{"$f":"C19","v":"A402"},{"$f":"IF(E19=\"\",\"\",E19)","v":""},null,null,{"$f":"IF($D$33=\"\",\"\",VLOOKUP(1,$A$33:$D$37,4,FALSE))","v":""},null,"classeA1",null,{"$f":"IF(G34=\"\",\"\",(ROUND(G34,2)))","v":""},null,null,"ACeS Activo","A905","ACeSActA"]
[{"$f":"IF(D35=\"\",\"\",RANK(D35,$D$33:$D$37,1))","v":""},4,"A403",{"$f":"IF(E20=\"\",\"\",E20)","v":""},null,null,{"$f":"IF($D$33=\"\",\"\",VLOOKUP(2,$A$33:$D$37,4,FALSE))","v":""},null,"classeA2",null,{"$f":"IF(G35=\"\",\"\",(ROUND(G35,2)))","v":""},null,null,"Valor",{"$f":"IF(D33=\"\",0,VLOOKUP(ACeSActA,DadosMapearA,2,FALSE))","v":0},"ACeSActValorA"]
[{"$f":"IF(D36=\"\",\"\",RANK(D36,$D$33:$D$37,1))","v":""},5,"A904",{"$f":"IF(E21=\"\",\"\",E21)","v":""},null,null,{"$f":"IF($D$33=\"\",\"\",VLOOKUP(3,$A$33:$D$37,4,FALSE))","v":""},null,"classeA3",null,"",null,null,"Código",{"$f":"VLOOKUP(ACeSActValorA,classeValoresA,3,TRUE)","v":"classeA0"},"ACeSActCodA"]
[{"$f":"IF(D37=\"\",\"\",RANK(D37,$D$33:$D$37,1))","v":""},6,"A905",{"$f":"IF(E22=\"\",\"\",E22)","v":""},null,null,{"$f":"IF($D$33=\"\",\"\",VLOOKUP(4,$A$33:$D$37,4,FALSE))","v":""},null,"classeA4",null,""]
[null,"ACeS_Select",{"$f":"IF(AnInd_codACeS=\"\",\"\",VLOOKUP(AnInd_codACeS,Id!$D$39:$G$45,2,FALSE))","v":""},null,null,null,{"$f":"IF($D$33=\"\",\"\",VLOOKUP(5,$A$33:$D$37,4,FALSE))","v":""},null,"classeA5",null,""]
[]
[null,"Legenda"]
[null,{"$f":"IF(TipoAn=\"A\",AnInd_baseT!D2 & \" \" & AnInd_baseT!E2 & \", 1996-2011 \" & AnInd_baseT!F2,\"\")","v":""}]
[null,{"$f":"IF(TipoAn=\"A\",AnInd_baseT!D2 & \" \" & AnInd_baseT!E2 & \", \" & C14,\"\")","v":""}]

{"sheet":"AnR","index":13,"n_rows":39,"n_cols":10,"rows_kept":39,"cut":false,"hidden":false,"merged":[[38,9,38,10],[41,1,41,11],[10,1,10,11],[21,1,21,5],[12,1,12,11],[34,8,34,11],[32,8,32,9],[33,8,33,11],[35,9,35,10],[36,9,36,10],[37,9,37,10],[1,1,1,11],[3,1,3,11],[5,1,5,5],[7,1,7,2],[5,6,6,9],[7,3,7,5]]}
[]
[null,"mort@lidades.infantil"]
[]
[null,"Análise da Razão R por Indicador"]
[]
[null,"Selecione o Indicador",null,null,null,null,"Selecione a Referência"]
[]
[null,"Selecione o ACeS",null,"Selecione o Quinquénio"]
[]
[]
[null,{"$f":"AnR_base!D1","v":""}]
[]
[null,{"$f":"AnR_base!B60","v":""}]
[null,null,"O","E","R",{"$f":"AnR_base!D39","v":"I.C. (95%)"}]
[null,{"$f":"AnR_base!B31","v":"Continente"},{"$f":"IF(AnR_base!F31=0,\"\",AnR_base!F31)","v":""}]
[null,{"$f":"AnR_base!L44","v":""},{"$f":"AnR_base!F44","v":""},{"$f":"AnR_base!G44","v":""},{"$f":"AnR_base!H44","v":""},{"$f":"AnR_base!K44","v":""},{"$f":"AnR_base!D44","v":""}]
[null,{"$f":"AnR_base!L45","v":""},{"$f":"AnR_base!F45","v":""},{"$f":"AnR_base!G45","v":""},{"$f":"AnR_base!H45","v":""},{"$f":"AnR_base!K45","v":""},{"$f":"AnR_base!D45","v":""}]
[null,{"$f":"AnR_base!L46","v":""},{"$f":"AnR_base!F46","v":""},{"$f":"AnR_base!G46","v":""},{"$f":"AnR_base!H46","v":""},{"$f":"AnR_base!K46","v":""},{"$f":"AnR_base!D46","v":""}]
[null,{"$f":"AnR_base!L47","v":""},{"$f":"AnR_base!F47","v":""},{"$f":"AnR_base!G47","v":""},{"$f":"AnR_base!H47","v":""},{"$f":"AnR_base!K47","v":""},{"$f":"AnR_base!D47","v":""}]
[null,{"$f":"AnR_base!L48","v":""},{"$f":"AnR_base!F48","v":""},{"$f":"AnR_base!G48","v":""},{"$f":"AnR_base!H48","v":""},{"$f":"AnR_base!K48","v":""},{"$f":"AnR_base!D48","v":""}]
[]
[null,{"$f":"AnR_base!B62","v":""}]
[]
[]
[]
[]
[]
[]
[]
[]
[]
[]
[null,null,null,null,null,null,null,null,"Legenda"]
[null,null,null,null,null,null,null,null,{"$f":"AnR_base!B60","v":""}]
[null,null,null,null,null,null,null,null,{"$f":"AnR_base!B61","v":""}]
[null,null,null,null,null,null,null,null,null,"R diminuída e significativa"]
[null,null,null,null,null,null,null,null,null,"R diminuída, mas não significativa"]
[null,null,null,null,null,null,null,null,null,"R aumentada, mas não significativa"]
[null,null,null,null,null,null,null,null,null,"R aumentadada e significativa"]

{"sheet":"AnR_base","index":14,"n_rows":62,"n_cols":17,"rows_kept":62,"cut":false,"hidden":true,"merged":[]}
[1,"AnR_IndSelect",{"$f":"IF(AnR_IndSelect=1,\"\",VLOOKUP(AnR_IndSelect,AnR_tabId,2,FALSE))","v":""},{"$f":"IF(AnR_IndSelect=1,\"\",VLOOKUP(AnR_IndSelect,AnR_tabId,3,FALSE))","v":""}]
[null,null,null,{"$f":"IF(AnR_IndSelect=1,\"\",VLOOKUP(AnR_IndSelect,AnR_tabIdLeg,4,FALSE))","v":""}]
["Rcod","Local_Residencia","Icod","Indicador","cod_IndRes","96-00","01-05","06-10","07-11"]
[{"$f":"Id!D39","v":"R01"},{"$f":"Id!F39","v":"Continente"},{"$f":"IF($C$1=\"\",\"\",$C$1)","v":""},{"$f":"IF($C$1=\"\",\"\",$D$1)","v":""},{"$f":"IF(C4=\"\",\"\",CONCATENATE(C4,A4))","v":""},{"$f":"IF(C4=\"\",\"\",VLOOKUP($E4,BaseQuinquenal,32,FALSE))","v":""},{"$f":"IF(C4=\"\",\"\",VLOOKUP($E4,BaseQuinquenal,33,FALSE))","v":""},{"$f":"IF(C4=\"\",\"\",VLOOKUP($E4,BaseQuinquenal,34,FALSE))","v":""},{"$f":"IF(C4=\"\",\"\",VLOOKUP($E4,BaseQuinquenal,35,FALSE))","v":""}]
[{"$f":"Id!D40","v":"R02"},{"$f":"Id!F40","v":"Região de Saúde do Alentejo"},{"$f":"IF($C$1=\"\",\"\",$C$1)","v":""},{"$f":"IF($C$1=\"\",\"\",$D$1)","v":""},{"$f":"IF(C5=\"\",\"\",CONCATENATE(C5,A5))","v":""},"","","",""]
[{"$f":"Id!D41","v":"R03"},{"$f":"Id!F41","v":"ACES Alentejo Litoral"},"","","","","","",""]
[{"$f":"Id!D42","v":"R04"},{"$f":"Id!F42","v":"ACES Alentejo Central I"},"","","","","","",""]
[{"$f":"Id!D43","v":"R05"},{"$f":"Id!F43","v":"ACES Alentejo Central II"},"","","","","","",""]
[{"$f":"Id!D44","v":"R06"},{"$f":"Id!F44","v":"ULS Norte Alentejano"},"","","","","","",""]
[{"$f":"Id!D45","v":"R07"},{"$f":"Id!F45","v":"ULS Baixo Alentejo"},"","","","","","",""]
[]
[{"$f":"IF(C1=\"\",\"\",IF(OR(C1=\"I22\",C1=\"I24\"),1,2))","v":""},"Denominador",{"$f":"IF(A12=\"\",\"\",IF(A12=1,\"I26\",\"I01\"))","v":""},{"$f":"IF(A12=\"\",\"\",VLOOKUP(AnR_codDenom,Id!$D$7:$G$34,3,FALSE))","v":""}]
[]
["Rcod","Local_Residencia","Icod","Indicador","cod_IndRes","96-00","01-05","06-10","07-11","Quinq_Select"]
[{"$f":"Id!D39","v":"R01"},{"$f":"Id!F39","v":"Continente"},{"$f":"IF($A$12=\"\",\"\",AnR_codDenom)","v":""},{"$f":"IF($A$12=\"\",\"\",AnR_IndDenom)","v":""},{"$f":"IF(C15=\"\",\"\",CONCATENATE(C15,A15))","v":""},{"$f":"IF(C15=\"\",\"\",VLOOKUP($E15,BaseQuinquenal,32,FALSE))","v":""},{"$f":"IF(C15=\"\",\"\",VLOOKUP($E15,BaseQuinquenal,33,FALSE))","v":""},{"$f":"IF(C15=\"\",\"\",VLOOKUP($E15,BaseQuinquenal,34,FALSE))","v":""},{"$f":"IF(C15=\"\",\"\",VLOOKUP($E15,BaseQuinquenal,35,FALSE))","v":""},{"$f":"IF(AnRComp_codACeS=\"\",\"\",HLOOKUP($D$25,$F$14:$I$21,2,FALSE))","v":""}]
[{"$f":"Id!D40","v":"R02"},{"$f":"Id!F40","v":"Região de Saúde do Alentejo"},"","",{"$f":"IF(C16=\"\",\"\",CONCATENATE(C16,A16))","v":""},"","","","",{"$f":"IF(AnRComp_codACeS=\"\",\"\",HLOOKUP($D$25,$F$14:$I$21,3,FALSE))","v":""}]
[{"$f":"Id!D41","v":"R03"},{"$f":"Id!F41","v":"ACES Alentejo Litoral"},"","","","","","","",{"$f":"IF(AnRComp_codACeS=\"\",\"\",HLOOKUP($D$25,$F$14:$I$21,4,FALSE))","v":""}]
[{"$f":"Id!D42","v":"R04"},{"$f":"Id!F42","v":"ACES Alentejo Central I"},"","","","","","","",{"$f":"IF(AnRComp_codACeS=\"\",\"\",HLOOKUP($D$25,$F$14:$I$21,5,FALSE))","v":""}]
[{"$f":"Id!D43","v":"R05"},{"$f":"Id!F43","v":"ACES Alentejo Central II"},"","","","","","","",{"$f":"IF(AnRComp_codACeS=\"\",\"\",HLOOKUP($D$25,$F$14:$I$21,6,FALSE))","v":""}]
[{"$f":"Id!D44","v":"R06"},{"$f":"Id!F44","v":"ULS Norte Alentejano"},"","","","","","","",{"$f":"IF(AnRComp_codACeS=\"\",\"\",HLOOKUP($D$25,$F$14:$I$21,7,FALSE))","v":""}]
[{"$f":"Id!D45","v":"R07"},{"$f":"Id!F45","v":"ULS Baixo Alentejo"},"","","","","","","",{"$f":"IF(AnRComp_codACeS=\"\",\"\",HLOOKUP($D$25,$F$14:$I$21,8,FALSE))","v":""}]
[]
[1,"AnR_ACeS",{"$f":"IF(AnR_ACeS=1,\"\",VLOOKUP(AnR_ACeS,AnACeS_tab,2,FALSE))","v":""},{"$f":"IF(AnR_ACeS=1,\"\",VLOOKUP(AnR_ACeS,AnACeS_tab,3,FALSE))","v":""},{"$f":"IF(AnR_CodACeS=\"\",\"\",VLOOKUP(AnR_CodACeS,AnR_TabQuinq,5,FALSE))","v":""},{"$f":"IF(AnR_CodACeS=\"\",\"\",VLOOKUP(AnR_CodACeS,AnR_TabQuinq,6,FALSE))","v":""},{"$f":"IF(AnR_CodACeS=\"\",\"\",VLOOKUP(AnR_CodACeS,AnR_TabQuinq,7,FALSE))","v":""},{"$f":"IF(AnR_CodACeS=\"\",\"\",VLOOKUP(AnR_CodACeS,AnR_TabQuinq,8,FALSE))","v":""}]
[]
[4,"AnR_Quinquenio",{"$f":"VLOOKUP(AnR_Quinquenio,AnR_IdQuinq,3,FALSE)","v":"2007-2011"},{"$f":"VLOOKUP(AnR_Quinquenio,AnR_IdQuinq,4,FALSE)","v":"07-11"}]
[null,null,null,null,null,"96-00","01-05","06-10","07-11","Quinq_Select"]
[1,"AnR_Comparador",{"$f":"IF(AnRComparador=1,A4,A5)","v":"R01"},{"$f":"IF(AnRComparador=1,B4,B5)","v":"Continente"},{"$f":"IF(AnRComp_codACeS=\"\",\"\",VLOOKUP(AnRComp_codACeS,AnR_TabQuinq,5,FALSE))","v":""},{"$f":"IF(AnRComp_codACeS=\"\",\"\",VLOOKUP(AnRComp_codACeS,AnR_TabQuinq,6,FALSE))","v":""},{"$f":"IF(AnRComp_codACeS=\"\",\"\",VLOOKUP(AnRComp_codACeS,AnR_TabQuinq,7,FALSE))","v":""},{"$f":"IF(AnRComp_codACeS=\"\",\"\",VLOOKUP(AnRComp_codACeS,AnR_TabQuinq,8,FALSE))","v":""},{"$f":"IF(AnRComp_codACeS=\"\",\"\",VLOOKUP(AnRComp_codACeS,AnR_TabQuinq,9,FALSE))","v":""},{"$f":"IF(AnRComp_codACeS=\"\",\"\",HLOOKUP($D$25,$F$26:$I$28,2,FALSE))","v":""}]
[null,null,{"$f":"IF(AnRComparador=1,A15,A16)","v":"R01"},{"$f":"IF(AnRComparador=1,B15,B16)","v":"Continente"},{"$f":"IF(AnRComp_codACeS=\"\",\"\",VLOOKUP(AnRComp_codACeS,AnR_TabDenom,5,FALSE))","v":""},{"$f":"IF(AnRComp_codACeS=\"\",\"\",VLOOKUP(AnRComp_codACeS,AnR_TabDenom,6,FALSE))","v":""},{"$f":"IF(AnRComp_codACeS=\"\",\"\",VLOOKUP(AnRComp_codACeS,AnR_TabDenom,7,FALSE))","v":""},{"$f":"IF(AnRComp_codACeS=\"\",\"\",VLOOKUP(AnRComp_codACeS,AnR_TabDenom,8,FALSE))","v":""},{"$f":"IF(AnRComp_codACeS=\"\",\"\",VLOOKUP(AnRComp_codACeS,AnR_TabDenom,9,FALSE))","v":""},{"$f":"IF(AnRComp_codACeS=\"\",\"\",HLOOKUP($D$25,$F$26:$I$28,3,FALSE))","v":""}]
[]
["Rcod","Local_Residencia","Icod","Indicador","cod_IndRes","O","E","R","IC_min","Ic_max"]
[{"$f":"AnRComp_codACeS","v":"R01"},{"$f":"D27","v":"Continente"},{"$f":"IF($C$4=\"\",\"\",C5)","v":""},"",{"$f":"IF(C31=\"\",\"\",CONCATENATE(C31,A31))","v":""},{"$f":"IF(E31=\"\",\"\",J27)","v":""},null,null,null,null,null,null,null,null,null,null,"Map"]
[{"$f":"A6","v":"R03"},"ACES Alentejo Litoral","","",{"$f":"IF(C32=\"\",\"\",CONCATENATE(C32,A32))","v":""},{"$f":"IF(OR(E32=\"\",$F$31=0),\"\",HLOOKUP($D$25,$E$3:$I$10,4,FALSE))","v":""},{"$f":"IF(OR(E32=\"\",$F$31=0),\"\",$J$27/$J$28*$J17)","v":""},{"$f":"IF(OR(E32=\"\",$F$31=0),\"\",F32/G32)","v":""},{"$f":"IF(OR(E32=\"\",$F$31=0),\"\",IF(F32>100,(1-1/(9*F32)-$B$41/(3*SQRT(F32)))^3*F32/G32,IF(F32>0,CHIINV($B$40,2*F32)/2/G32,0)))","v":""},{"$f":"IF(OR(E32=\"\",$F$31=0),\"\",IF(F32>100,(1-1/(9*(F32+1))+$B$41/(3*SQRT(F32+1)))^3*(F32+1)/G32,IF(F32>0,CHIINV($B$39,2*(F32+1))/2/G32,CHIINV($B$39,2)/2/G32)))","v":""},null,1,{"$f":"IF(OR(E32=\"\",$F$31=0),\"\",RANK(H32,$H$32:$H$36,0))","v":""},{"$f":"IF(E32=\"\",\"\",Id!E41)","v":""},{"$f":"IF(C32=\"\",\"\",B32)","v":""},{"$f":"IF(OR(E32=\"\",$F$31=0),\"\",E32)","v":""},{"$f":"IF(H32=\"\",\"\",IF(AND(H32<1,J32<1),2,IF(AND(H32>1,I32>1),-2,IF(AND(H32<1,J32>1),1,-1))))","v":""}]
["R04","ACES Alentejo Central I","","","",{"$f":"IF(OR(E33=\"\",$F$31=0),\"\",HLOOKUP($D$25,$E$3:$I$10,5,FALSE))","v":""},{"$f":"IF(OR(E33=\"\",$F$31=0),\"\",$J$27/$J$28*$J18)","v":""},{"$f":"IF(OR(E33=\"\",$F$31=0),\"\",F33/G33)","v":""},{"$f":"IF(OR(E33=\"\",$F$31=0),\"\",IF(F33>100,(1-1/(9*F33)-$B$41/(3*SQRT(F33)))^3*F33/G33,IF(F33>0,CHIINV($B$40,2*F33)/2/G33,0)))","v":""},{"$f":"IF(OR(E33=\"\",$F$31=0),\"\",IF(F33>100,(1-1/(9*(F33+1))+$B$41/(3*SQRT(F33+1)))^3*(F33+1)/G33,IF(F33>0,CHIINV($B$39,2*(F33+1))/2/G33,CHIINV($B$39,2)/2/G33)))","v":""},null,2,{"$f":"IF(OR(E33=\"\",$F$31=0),\"\",RANK(H33,$H$32:$H$36,0))","v":""},{"$f":"IF(E33=\"\",\"\",Id!E42)","v":""},{"$f":"IF(C33=\"\",\"\",B33)","v":""},{"$f":"IF(OR(E33=\"\",$F$31=0),\"\",E33)","v":""},{"$f":"IF(H33=\"\",\"\",IF(AND(H33<1,J33<1),2,IF(AND(H33>1,I33>1),-2,IF(AND(H33<1,J33>1),1,-1))))","v":""}]
["R05","ACES Alentejo Central II","","","",{"$f":"IF(OR(E34=\"\",$F$31=0),\"\",HLOOKUP($D$25,$E$3:$I$10,6,FALSE))","v":""},{"$f":"IF(OR(E34=\"\",$F$31=0),\"\",$J$27/$J$28*$J19)","v":""},"",{"$f":"IF(OR(E34=\"\",$F$31=0),\"\",IF(F34>100,(1-1/(9*F34)-$B$41/(3*SQRT(F34)))^3*F34/G34,IF(F34>0,CHIINV($B$40,2*F34)/2/G34,0)))","v":""},{"$f":"IF(OR(E34=\"\",$F$31=0),\"\",IF(F34>100,(1-1/(9*(F34+1))+$B$41/(3*SQRT(F34+1)))^3*(F34+1)/G34,IF(F34>0,CHIINV($B$39,2*(F34+1))/2/G34,CHIINV($B$39,2)/2/G34)))","v":""},null,3,{"$f":"IF(OR(E34=\"\",$F$31=0),\"\",RANK(H34,$H$32:$H$36,0))","v":""},{"$f":"IF(E34=\"\",\"\",Id!E43)","v":""},"","",""]
["R06","ULS Norte Alentejano","","","",{"$f":"IF(OR(E35=\"\",$F$31=0),\"\",HLOOKUP($D$25,$E$3:$I$10,7,FALSE))","v":""},{"$f":"IF(OR(E35=\"\",$F$31=0),\"\",$J$27/$J$28*$J20)","v":""},"",{"$f":"IF(OR(E35=\"\",$F$31=0),\"\",IF(F35>100,(1-1/(9*F35)-$B$41/(3*SQRT(F35)))^3*F35/G35,IF(F35>0,CHIINV($B$40,2*F35)/2/G35,0)))","v":""},{"$f":"IF(OR(E35=\"\",$F$31=0),\"\",IF(F35>100,(1-1/(9*(F35+1))+$B$41/(3*SQRT(F35+1)))^3*(F35+1)/G35,IF(F35>0,CHIINV($B$39,2*(F35+1))/2/G35,CHIINV($B$39,2)/2/G35)))","v":""},null,4,{"$f":"IF(OR(E35=\"\",$F$31=0),\"\",RANK(H35,$H$32:$H$36,0))","v":""},{"$f":"IF(E35=\"\",\"\",Id!E44)","v":""},"","",""]
["R07","ULS Baixo Alentejo","","","",{"$f":"IF(OR(E36=\"\",$F$31=0),\"\",HLOOKUP($D$25,$E$3:$I$10,8,FALSE))","v":""},{"$f":"IF(OR(E36=\"\",$F$31=0),\"\",$J$27/$J$28*$J21)","v":""},"",{"$f":"IF(OR(E36=\"\",$F$31=0),\"\",IF(F36>100,(1-1/(9*F36)-$B$41/(3*SQRT(F36)))^3*F36/G36,IF(F36>0,CHIINV($B$40,2*F36)/2/G36,0)))","v":""},{"$f":"IF(OR(E36=\"\",$F$31=0),\"\",IF(F36>100,(1-1/(9*(F36+1))+$B$41/(3*SQRT(F36+1)))^3*(F36+1)/G36,IF(F36>0,CHIINV($B$39,2*(F36+1))/2/G36,CHIINV($B$39,2)/2/G36)))","v":""},null,5,{"$f":"IF(OR(E36=\"\",$F$31=0),\"\",RANK(H36,$H$32:$H$36,0))","v":""},{"$f":"IF(E36=\"\",\"\",Id!E45)","v":""},"","",""]
[]
[2,{"$f":"VLOOKUP(A38,E38:I40,2,FALSE)","v":0.95},null,"Intervalos de Confiança",1,0.9,0.05,0.95,{"$f":"NORMSINV(H38)","v":1.6448536269514715}]
[null,{"$f":"VLOOKUP(A38,E38:I40,3,FALSE)","v":2.5000000000000001E-2},null,{"$f":"\"I.C. (\" & B38*100 & \"%)\"","v":"I.C. (95%)"},2,0.95,2.5000000000000001E-2,0.97499999999999998,{"$f":"NORMSINV(H39)","v":1.9599639845400536}]
[null,{"$f":"VLOOKUP(A38,E38:I40,4,FALSE)","v":0.97499999999999998},null,null,3,0.98,0.01,0.99,{"$f":"NORMSINV(H40)","v":2.3263478740408408}]
[null,{"$f":"VLOOKUP(A38,E38:I40,5,FALSE)","v":1.9599639845400536}]
[]
[null,null,null,null,"Map","O","E","R","IC_min","Ic_max"]
[{"$f":"IF(OR(E32=\"\",$F$31=0),\"\",VLOOKUP(L32,$M$32:$P$36,2,FALSE))","v":""},{"$f":"IF(OR(E32=\"\",$F$31=0),\"\",VLOOKUP(L32,$M$32:$P$36,3,FALSE))","v":""},{"$f":"IF(OR(E32=\"\",$F$31=0),\"\",VLOOKUP(L32,$M$32:$P$36,4,FALSE))","v":""},{"$f":"IF($E$23=\"\",\"\",IF(C44=$E$23,E44,\"\"))","v":""},{"$f":"IF(OR(E32=\"\",$F$31=0),\"\",VLOOKUP(L32,$M$32:$Q$36,5,FALSE))","v":""},{"$f":"IF($A44=\"\",\"\",VLOOKUP($C44,$E$32:$J$36,2,FALSE))","v":""},{"$f":"IF($A44=\"\",\"\",VLOOKUP($C44,$E$32:$J$36,3,FALSE))","v":""},{"$f":"IF($A44=\"\",\"\",VLOOKUP($C44,$E$32:$J$36,4,FALSE)*100)","v":""},{"$f":"IF($A44=\"\",\"\",VLOOKUP($C44,$E$32:$J$36,5,FALSE)*100)","v":""},{"$f":"IF($A44=\"\",\"\",VLOOKUP($C44,$E$32:$J$36,6,FALSE)*100)","v":""},{"$f":"IF(A44=\"\",\"\",CONCATENATE(\"(\",FIXED(I44,1),\" - \",FIXED(J44,1),\")\"))","v":""},{"$f":"IF(A44=\"\",\"\",CONCATENATE(B44,\" (\",A44,\")\"))","v":""}]
[{"$f":"IF(OR(E33=\"\",$F$31=0),\"\",VLOOKUP(L33,$M$32:$P$36,2,FALSE))","v":""},{"$f":"IF(OR(E33=\"\",$F$31=0),\"\",VLOOKUP(L33,$M$32:$P$36,3,FALSE))","v":""},{"$f":"IF(OR(E33=\"\",$F$31=0),\"\",VLOOKUP(L33,$M$32:$P$36,4,FALSE))","v":""},{"$f":"IF($E$23=\"\",\"\",IF(C45=$E$23,E45,\"\"))","v":""},{"$f":"IF(OR(E33=\"\",$F$31=0),\"\",VLOOKUP(L33,$M$32:$Q$36,5,FALSE))","v":""},{"$f":"IF($A45=\"\",\"\",VLOOKUP($C45,$E$32:$J$36,2,FALSE))","v":""},{"$f":"IF($A45=\"\",\"\",VLOOKUP($C45,$E$32:$J$36,3,FALSE))","v":""},{"$f":"IF($A45=\"\",\"\",VLOOKUP($C45,$E$32:$J$36,4,FALSE)*100)","v":""},{"$f":"IF($A45=\"\",\"\",VLOOKUP($C45,$E$32:$J$36,5,FALSE)*100)","v":""},{"$f":"IF($A45=\"\",\"\",VLOOKUP($C45,$E$32:$J$36,6,FALSE)*100)","v":""},{"$f":"IF(A45=\"\",\"\",CONCATENATE(\"(\",FIXED(I45,1),\" - \",FIXED(J45,1),\")\"))","v":""},{"$f":"IF(A45=\"\",\"\",CONCATENATE(B45,\" (\",A45,\")\"))","v":""}]
[{"$f":"IF(OR(E34=\"\",$F$31=0),\"\",VLOOKUP(L34,$M$32:$P$36,2,FALSE))","v":""},{"$f":"IF(OR(E34=\"\",$F$31=0),\"\",VLOOKUP(L34,$M$32:$P$36,3,FALSE))","v":""},{"$f":"IF(OR(E34=\"\",$F$31=0),\"\",VLOOKUP(L34,$M$32:$P$36,4,FALSE))","v":""},"",{"$f":"IF(OR(E34=\"\",$F$31=0),\"\",VLOOKUP(L34,$M$32:$Q$36,5,FALSE))","v":""},{"$f":"IF($A46=\"\",\"\",VLOOKUP($C46,$E$32:$J$36,2,FALSE))","v":""},{"$f":"IF($A46=\"\",\"\",VLOOKUP($C46,$E$32:$J$36,3,FALSE))","v":""},{"$f":"IF($A46=\"\",\"\",VLOOKUP($C46,$E$32:$J$36,4,FALSE)*100)","v":""},{"$f":"IF($A46=\"\",\"\",VLOOKUP($C46,$E$32:$J$36,5,FALSE)*100)","v":""},{"$f":"IF($A46=\"\",\"\",VLOOKUP($C46,$E$32:$J$36,6,FALSE)*100)","v":""},"",""]
[{"$f":"IF(OR(E35=\"\",$F$31=0),\"\",VLOOKUP(L35,$M$32:$P$36,2,FALSE))","v":""},{"$f":"IF(OR(E35=\"\",$F$31=0),\"\",VLOOKUP(L35,$M$32:$P$36,3,FALSE))","v":""},{"$f":"IF(OR(E35=\"\",$F$31=0),\"\",VLOOKUP(L35,$M$32:$P$36,4,FALSE))","v":""},"",{"$f":"IF(OR(E35=\"\",$F$31=0),\"\",VLOOKUP(L35,$M$32:$Q$36,5,FALSE))","v":""},{"$f":"IF($A47=\"\",\"\",VLOOKUP($C47,$E$32:$J$36,2,FALSE))","v":""},{"$f":"IF($A47=\"\",\"\",VLOOKUP($C47,$E$32:$J$36,3,FALSE))","v":""},{"$f":"IF($A47=\"\",\"\",VLOOKUP($C47,$E$32:$J$36,4,FALSE)*100)","v":""},{"$f":"IF($A47=\"\",\"\",VLOOKUP($C47,$E$32:$J$36,5,FALSE)*100)","v":""},{"$f":"IF($A47=\"\",\"\",VLOOKUP($C47,$E$32:$J$36,6,FALSE)*100)","v":""},"",""]
[{"$f":"IF(OR(E36=\"\",$F$31=0),\"\",VLOOKUP(L36,$M$32:$P$36,2,FALSE))","v":""},{"$f":"IF(OR(E36=\"\",$F$31=0),\"\",VLOOKUP(L36,$M$32:$P$36,3,FALSE))","v":""},{"$f":"IF(OR(E36=\"\",$F$31=0),\"\",VLOOKUP(L36,$M$32:$P$36,4,FALSE))","v":""},"",{"$f":"IF(OR(E36=\"\",$F$31=0),\"\",VLOOKUP(L36,$M$32:$Q$36,5,FALSE))","v":""},{"$f":"IF($A48=\"\",\"\",VLOOKUP($C48,$E$32:$J$36,2,FALSE))","v":""},{"$f":"IF($A48=\"\",\"\",VLOOKUP($C48,$E$32:$J$36,3,FALSE))","v":""},{"$f":"IF($A48=\"\",\"\",VLOOKUP($C48,$E$32:$J$36,4,FALSE)*100)","v":""},{"$f":"IF($A48=\"\",\"\",VLOOKUP($C48,$E$32:$J$36,5,FALSE)*100)","v":""},{"$f":"IF($A48=\"\",\"\",VLOOKUP($C48,$E$32:$J$36,6,FALSE)*100)","v":""},"",""]
[]
["Mapear"]
[null,null,"ACeS"]
[null,null,{"$f":"Id!E41","v":"A401"},{"$f":"IF(Q32=\"\",\"\",Q32)","v":""},null,null,0,"classeR0"]
[null,null,{"$f":"Id!E42","v":"A402"},{"$f":"IF(Q33=\"\",\"\",Q33)","v":""},null,null,2,"classeR1",null,"ACeS Activo","A403","ACeSActR"]
[null,null,{"$f":"Id!E43","v":"A403"},{"$f":"IF(Q34=\"\",\"\",Q34)","v":""},null,null,1,"classeR2",null,"Valor",{"$f":"IF(D52=\"\",0,VLOOKUP(ACeSActR,DadosMapearR,2,FALSE))","v":0},"ACeSActValorR"]
[null,null,{"$f":"Id!E44","v":"A904"},{"$f":"IF(Q35=\"\",\"\",Q35)","v":""},null,null,-1,"classeR3",null,"Código",{"$f":"VLOOKUP(ACeSActValorR,classeValoresR,2,FALSE)","v":"classeR0"},"ACeSActCodR"]
[null,null,{"$f":"Id!E45","v":"A905"},{"$f":"IF(Q36=\"\",\"\",Q36)","v":""},null,null,-2,"classeR4"]
[null,"AnR_ACeS_Select",{"$f":"IF(AnR_CodACeS=\"\",\"\",VLOOKUP(AnR_CodACeS,Id!$D$39:$G$45,2,FALSE))","v":""}]
[]
[null,"Legenda"]
[null,{"$f":"IF(AnR_IndSelect=1,\"\",D2 & \", QUINQUÉNIO \" & C25)","v":""}]
[null,{"$f":"IF(AnR_IndSelect=1,\"\",\"Comparação com \" & D27 & \", \" & D39)","v":""}]
[null,{"$f":"IF(AnR_IndSelect=1,\"\",\"Comparação com \" & D27 & \", R=100\")","v":""}]