{"text_format":"1","workbook":"xlsx","n_sheets":15,"sheets":["CAPA","PagIn","BASE","Id","ConsAnual","DadosAnual","DefInd","AnACeS","AnACeS_base","AnIndT","AnIndA","AnInd_baseT","AnInd_baseA","AnR","AnR_base"],"not_rendered":{"charts":19,"images":14,"macros":1,"external_links":0,"defined_names":102,"comments":0,"pivot_tables":0},"unopened":[],"bounds":{"document_bytes":16777216,"sheet_cells":100000,"rows_first":2000,"rows_last":500,"rows_between":2000,"halvings":0,"cell_chars":16384,"cell_head_chars":4096},"cells_cut":0,"cells_raw":0,"read":"whole","date_system":"1900"}

{"sheet":"CAPA","index":0,"n_rows":2,"n_cols":2,"rows_kept":2,"cut":false,"hidden":false,"merged":[[1,1,1,3],[23,2,23,3]]}
[]
[null,"mort@lidades.infantil"]

{"sheet":"PagIn","index":1,"n_rows":17,"n_cols":4,"rows_kept":17,"cut":false,"hidden":false,"merged":[[1,1,1,3],[3,1,3,3],[13,1,15,1],[20,1,20,3]]}
[]
[null,"mort@lidades.infantil"]
[]
[null,"Página Inicial"]
[]
[]
[null,"Consulta de Indicadores (Anual)",null,"Análise por Indicador"]
[]
[null,null,null,"  Selecione o Indicador"]
[]
[null,"Permite consultar o valor anual (1996-2016)  por indicador ou por local de residência.",null,"Permite observar a evolução de um determinado indicador para o Continente, para a região Alentejo e, caso pretenda, para um determinado ACeS. Para um determinado triénio (ou ano) podem observar-se, também, os valores do respetivo indicador ordenados por ACeS através de um gráfico de barras e o seu mapeamento."]
[]
[null,"Análise por ACeS",null,"Análise da Razão R por Indicador"]
[]
[null,null,null,"  Selecione o Indicador"]
[]
[null,"Permite visualizar a evolução de vários indicadores num determinado ACeS, comparativamente com o Continente e a região Alentejo, numa única página.",null,"Permite evidenciar variações geográficas com recurso à razão entre o número de acontecimentos observados e o número de acontecimentos esperados nos ACeS, caso fossem observadas as distribuições do indicador para o Continente ou para a região Alentejo."]

{"sheet":"BASE","index":2,"n_rows":165,"n_cols":52,"rows_kept":165,"cut":false,"hidden":true,"merged":[]}
["Icod","Indicador","cod_Res","Rcod","Local_Residencia","Local_Residencia2","cod_IndRes","A96","A97","A98","A99","A00","A01","A02","A03","A04","A05","A06","A07","A08","A09","A10","A11","A12","A13","A14","A15","A16","T01","T02","T03","T04","T05","T06","T07","T08","T09","T10","T11","T12","T13","T14","T15","T16","T17","T18","T19","Q01","Q02","Q03","Q04","Q05"]
["I27","População Média","CT","R01","CONTINENTE","Continente","I27R01",9580149,9626139.5,9677652,9734757,9805338.5,9874675,9927082,9962630,9984537,10001053.5,10017040,10034679,10047363,10055535,10058931.5,10044483.5,10003808.5,9947598.5,9894165.5,9854461.5,9824277,28878418.5,29032956,29204271,29416015.5,29624025,29781246,29887890,29953611,30003160.5,30051120,30104037,30142089,30166605,30176794.5,30133450.5]
["I27","População Média","RA","R02","REGIÃO ALENTEJO","Região Alentejo","I27R02",541081.5,539294,537854.5,536530.5,535732.5,535051.5,533745,531694,529452.5,527028,524418,521978,519076.5,515940,512685.5,508862.5,504272.5,499417,493418.5,486366.5,480546.5,1617882,1613563.5,1609591.5,1607197.5,1605154.5,1601235,1595082,1588357.5,1581084,1573254,1565934,1557229.5,1547820,1538056.5,1526587.5]
["I27","População Média","A101","R03","ALENTEJO CENTRAL","ACeS Alentejo Central","I27R03",173455,173360.5,173310,173294,173455.5,173497,173221.5,172754.5,172268,171686,171012.5,170374,169531.5,168567.5,167546,166341.5,164834,163151,161091.5,158803.5,156976.5,520081.5,519930,519882,520366.5,520491,519664.5,518263.5,516804,515058,513037.5,511122,508594.5,505702.5,502638,499024.5]
["I27","População Média","A102","R04","ALTO ALENTEJO","ULS Norte Alentejano","I27R04",130187.5,129343.5,128609,127931,127354.5,126827,126254,125527.5,124733.5,123917,123065.5,122223,121307.5,120368.5,119379,118107.5,116510,114900,113110.5,111159.5,109411.5,388030.5,385827,383793,382063.5,380481,378762,376582.5,374200.5,371751,369196.5,366669,363922.5,361105.5,358137,354322.5]
["I27","População Média","A103","R05","BAIXO ALENTEJO","ULS Baixo Alentejo","I27R05",138154,137275,136557,135821.5,135244.5,134831.5,134249.5,133456.5,132666,131886.5,131071,130305,129409,128453.5,127492.5,126418.5,125282.5,124144,122728.5,120993.5,119576,411825,409671,407464.5,405733.5,404494.5,402748.5,400369.5,397998,395659.5,393213,390915,388227,385360.5,382477.5,379255.5]
["I27","População Média","A104","R06","ALENTEJO LITORAL ","ULS Litoral Alentejano","I27R06",99285,99315,99378.5,99484,99678,99896,100020,99955.5,99785,99538.5,99269,99076,98828.5,98550.5,98268,97995,97646,97222,96488,95410,94582.5,297945,298135.5,298452,299034,299688,300060,299866.5,299355,298615.5,297807,297228,296485.5,295651.5,294804,293985]
["I01","Nados Vivos","CT","R01","CONTINENTE","Continente","I01R01",103668,106299,106857,109381,113318,106479,108192,106232,103309,103420,99713,96925,99057,94324,96133,91700,85306,78606,78312,81292,83005,316824,322537,329556,329178,327989,320903,317733,312961,306442,300058,295695,290306,289514,282158,273140,null,null,null,null,539523,527632,486152,{"$f":"W8+X8+Y8+Z8+AA8","v":415216},{"$f":"X8+Y8+Z8+AA8+AB8","v":406521}]
["I01","Nados Vivos","RA","R02","REGIÃO ALENTEJO","Região Alentejo","I01R02",4393,4673,4653,4688,4778,4423,4543,4597,4582,4480,4102,3999,4188,4038,4145,4090,3937,3532,3397,3612,3659,13719,14014,14119,13889,13744,13563,13722,13659,13164,12581,12289,12225,12371,12274,12173,null,null,null,null,23185,22625,20472,{"$f":"W9+X9+Y9+Z9+AA9","v":18568},{"$f":"X9+Y9+Z9+AA9+AB9","v":18137}]
["I01","Nados Vivos","A101","R03","ALENTEJO CENTRAL","ACeS Alentejo Central","I01R03",1486,1605,1545,1568,1592,1482,1532,1571,1559,1462,1462,1356,1412,1307,1320,1364,1289,1152,1102,1184,1228,4636,4718,4705,4642,4606,4585,4662,4592,4483,4280,4230,4075,4039,3991,3973,null,null,null,null,7796,7606,6857,6091,5955]
["I01","Nados Vivos","A102","R04","ALTO ALENTEJO","ULS Norte Alentejano","I01R04",1056,1108,1075,1154,1147,1035,1052,1015,979,999,851,802,896,879,914,877,820,793,715,779,731,3239,3337,3376,3336,3234,3102,3046,2993,2829,2652,2549,2577,2689,2671,2612,null,null,null,null,5540,5080,4342,3984,3838]
["I01","Nados Vivos","A103","R05","BAIXO ALENTEJO","ULS Baixo Alentejo","I01R05",1108,1180,1255,1136,1236,1121,1164,1178,1182,1198,1041,1091,1065,1063,1087,1016,1058,921,937,948,1020,3543,3571,3627,3493,3521,3463,3524,3558,3421,3330,3197,3219,3215,3166,3161,null,null,null,null,5915,5843,5347,4880,4884]
["I01","Nados Vivos","A104","R06","ALENTEJO LITORAL ","ULS Litoral Alentejano","I01R06",743,780,778,830,803,785,795,833,862,821,748,750,815,789,824,833,770,666,643,701,680,2301,2388,2411,2418,2383,2413,2490,2516,2431,2319,2313,2354,2428,2446,2427,null,null,null,null,3934,4096,3926,3613,3460]
["I02","Taxa Bruta de Natalidade","CT","R01","CONTINENTE","Continente","I02R01",10.821126059730386,11.042744601820905,11.041624559345594,11.236130496118188,11.556765735318571,10.783038429112857,10.898670928677733,10.663047809664718,10.346899410558548,10.340910585069862,9.9543378083745289,9.6590035416180218,9.8590047955866638,9.3803064680297972,9.5569792875117994,9.1293892811910133,8.527352357854511,7.9020077056789138,7.9149676645291613,8.2492584703892753,8.4489677968159906]
["I02","Taxa Bruta de Natalidade","RA","R02","REGIÃO ALENTEJO","Região Alentejo","I02R02",8.1189247830502431,8.6650324312897968,8.6510385243592829,8.7376206944432795,8.9186300999099366,8.2664939730100748,8.5115551433737089,8.6459504903196187,8.6542229945084781,8.5004971272873551,7.8220045841294539,7.6612424278417866,8.068174922193549,7.8264914524944755,8.0848785463993025,8.0375346974870432,7.8072867348507007,7.0722462391148078,6.8846222831126118,7.4264983299631036,7.6142475285950475]
["I02","Taxa Bruta de Natalidade","A101","R03","ALENTEJO CENTRAL","ACeS Alentejo Central","I02R03",8.5670635035023484,9.2581643453958655,8.9146615890600653,9.0482070931480614,9.1781465563213622,8.5419344426704775,8.8441677274472283,9.0938296831631025,9.0498525553207791,8.5155458220239275,8.5490826693955118,7.9589608743118081,8.3288356441133349,7.7535705281267147,7.8784333854583224,8.1999981964813351,7.8199885945860679,7.0609435430981113,6.8408326944624642,7.4557550683706593,7.8228269836567899]
["I02","Taxa Bruta de Natalidade","A102","R04","ALTO ALENTEJO","ULS Norte Alentejano","I02R04",8.1113778204512723,8.5663369245458796,8.35866852242067,9.0204876066004331,9.0063562732373033,8.1607228744667921,8.3324092702013388,8.0858775965425895,7.8487334998216198,8.0618478497704107,6.9150167999967502,6.5617764250591133,7.3861879933227543,7.3025750092424513,7.6562879568433306,7.4254386893296367,7.0380224873401431,6.9016536118363794,6.321252226804762,7.007948038629177,6.681198959889957]
["I02","Taxa Bruta de Natalidade","A103","R05","BAIXO ALENTEJO","ULS Baixo Alentejo","I02R05",8.020035612432503,8.5958841741030767,9.1903014858264314,8.3639188199217358,9.1390038042212431,8.314080908393068,8.6704233535320423,8.8268462008219899,8.909592510515127,9.0835680679978612,7.9422603016685613,8.3726641341468095,8.2297212713180699,8.2753681293230628,8.5259917250034327,8.036798411624881,8.4449144932452658,7.4188039695837089,7.6347384674301413,7.8351316393029373,8.5301398273901121]
["I02","Taxa Bruta de Natalidade","A104","R06","ALENTEJO LITORAL ","ULS Litoral Alentejano","I02R06",7.483507075590472,7.8537985198610487,7.8286550913930082,8.3430501387157729,8.0559401272096149,7.8581724993993758,7.9484103179364132,8.3337085002826257,8.6385729318033775,8.2480648191403336,7.5350814453656225,7.5699463038475514,8.2466090247246502,8.006047660843933,8.3852322220865396,8.5004336955967137,7.8856276754808183,6.8503013721174213,6.6640411242848856,7.3472382349858512,7.1894906563053427]
["I03","NV <20 anos","CT","R01","CONTINENTE","Continente","I03R01",7165,6970,6777,6701,6813,6236,6101,5551,5264,4983,4438,4369,4132,3927,3726,3331,3051,2587,2282,2114,2024,20912,20448,20291,19750,19150,17888,16916,15798,14685,13790,12939,12428,11785,10984,10108,null,null,null,null,34426,28135,20592,{"$f":"W20+X20+Y20+Z20+AA20","v":13365},{"$f":"X20+Y20+Z20+AA20+AB20","v":12058}]
["I03","NV <20 anos","RA","R02","REGIÃO ALENTEJO","Região Alentejo","I03R02",497,496,426,429,419,380,388,362,329,296,257,255,223,212,226,220,200,174,177,154,150,1419,1351,1274,1228,1187,1130,1079,987,882,808,735,690,661,658,646,null,null,null,null,2267,1755,1173,{"$f":"W21+X21+Y21+Z21+AA21","v":925},{"$f":"X21+Y21+Z21+AA21+AB21","v":855}]
["I03","NV <20 anos","A101","R03","ALENTEJO CENTRAL","ACeS Alentejo Central","I03R03",150,152,120,130,127,128,107,114,98,85,87,80,57,51,51,58,48,47,39,34,38,422,402,377,385,362,349,319,297,270,252,224,188,159,160,157,null,null,null,null,679,532,326,226,206]
["I03","NV <20 anos","A102","R04","ALTO ALENTEJO","ULS Norte Alentejano","I03R04",104,108,98,97,113,92,106,88,67,72,62,53,47,54,60,41,51,39,50,40,36,310,303,308,302,311,286,261,227,201,187,162,154,161,155,152,null,null,null,null,520,425,276,221,216]
["I03","NV <20 anos","A103","R05","BAIXO ALENTEJO","ULS Baixo Alentejo","I03R05",147,161,126,134,117,104,106,101,102,89,74,85,87,72,73,84,73,55,71,63,61,434,421,377,355,327,311,309,292,265,248,246,244,232,229,230,null,null,null,null,685,502,391,346,323]
["I03","NV <20 anos","A104","R06","ALENTEJO LITORAL ","ULS Litoral Alentejano","I03R06",96,75,82,68,62,56,69,59,62,50,34,37,32,35,42,37,28,33,17,17,15,253,225,212,186,187,184,190,171,146,121,103,104,109,114,107,null,null,null,null,383,296,180,132,110]
["I04","Proporção NV <20 anos","CT","R01","CONTINENTE","Continente","I04R01",6.9114866689817491,6.5569760769151166,6.3421207782363345,6.1262925005256852,6.0122840148961334,5.8565538744729011,5.6390490979000303,5.2253558249868215,5.095393431356416,4.8182169793076772,4.4507737205780593,4.5076089760123805,4.1713356956095984,4.163309444043934,3.8758802908470558,3.6324972737186476,3.5765362342625373,3.2910973717019059,2.9139850852998266,2.6005018944053533,2.438407324859948,6.6005100623690121,6.3397377665198098,6.1570719392151858,5.9997934248339799,5.8386104412038211,5.5742701065430982,5.3239669785637629,5.0479133182728839,4.7920976889590854,4.5957781495577521,4.3757926241566478,4.2810000482249766,4.0706148925440573,3.8928681549633715,3.700679873617462,3.5088337010781969,3.2697007728383647,2.9314470425255026,2.6462332394923518]
["I04","Proporção NV <20 anos","RA","R02","REGIÃO ALENTEJO","Região Alentejo","I04R02",11.313453221033463,10.614166488337256,9.1553836234687296,9.1510238907849839,8.7693595646714115,8.5914537644132949,8.5406119304424397,7.874700891886012,7.1802706241815795,6.6071428571428577,6.2652364700146279,6.3765941485371345,5.3247373447946513,5.2501238236750867,5.4523522316043422,5.3789731051344738,5.0800101600203202,4.9263873159682898,5.2104798351486608,4.2635658914728678,4.0994807324405569,10.343319483927401,9.6403596403596392,9.0233019335646993,8.841529267765857,8.6364959254947617,8.3314900833149004,7.8632852353884273,7.2260048319789147,6.7000911577028255,6.4223829584293775,5.9809585808446579,5.6441717791411046,5.343141217363188,5.3613623400961457,5.3072625698324023,5.1388528419413442,5.0708632431437515,4.7908168105492841,4.5088113985751779]
["I04","Proporção NV <20 anos","A101","R03","ALENTEJO CENTRAL","ACeS Alentejo Central","I04R03",10.094212651413189,9.4704049844236771,7.7669902912621351,8.2908163265306118,7.9773869346733663,8.6369770580296894,6.9843342036553526,7.2565245066836415,6.2860808210391275,5.8139534883720927,5.9507523939808484,5.8997050147492622,4.0368271954674215,3.9020657995409334,3.8636363636363633,4.2521994134897358,3.7238169123351437,4.0798611111111116,3.5390199637023589,2.8716216216216219,3.0944625407166124,9.1026747195858508,8.5205595591352274,8.0127523910733256,8.293838862559241,7.8593139383412947,7.6117775354416581,6.8425568425568422,6.4677700348432055,6.0227526210127147,5.8878504672897192,5.2955082742316781,4.6134969325153374,3.9366179747462247,4.0090202956652474,3.9516737981374277,4.0210249671484881,3.7821055602596667,3.4904013961605584,3.158793397837222]
["I04","Proporção NV <20 anos","A102","R04","ALTO ALENTEJO","ULS Norte Alentejano","I04R04",9.8484848484848477,9.7472924187725631,9.1162790697674403,8.4055459272097046,9.8517872711421095,8.8888888888888893,10.076045627376425,8.6699507389162562,6.8437180796731365,7.2072072072072073,7.2855464159811989,6.6084788029925194,5.2455357142857144,6.1433447098976108,6.5645514223194743,4.6750285062713797,6.2195121951219514,4.918032786885246,6.9930069930069934,5.1347881899871632,4.9247606019151844,9.5708552022229085,9.0800119868145046,9.1232227488151665,9.0527577937649895,9.616573902288188,9.2198581560283674,8.5686145764937613,7.5843635148680253,7.1049840933191941,7.0512820512820511,6.3554335033346412,5.9759410166860691,5.9873558943845291,5.8052434456928843,5.8215243201838378,5.261044176706827,6.0137457044673539,5.6405771753388718,5.6629213483146073]
["I04","Proporção NV <20 anos","A103","R05","BAIXO ALENTEJO","ULS Baixo Alentejo","I04R05",13.267148014440433,13.644067796610168,10.039840637450199,11.795774647887324,9.4660194174757279,9.2774308652988395,9.1065292096219927,8.5738539898132426,8.6294416243654819,7.4290484140233719,7.1085494716618642,7.7910174152153981,8.169014084507042,6.7732831608654749,6.7157313707451705,8.2677165354330722,6.8998109640831764,5.9717698154180239,7.5773745997865527,6.6455696202531636,5.9803921568627452,12.249506068303697,11.789414729767572,10.394265232974909,10.163183509876896,9.287134336836127,8.980652613341034,8.7684449489216796,8.206857785272625,7.7462730195849163,7.4474474474474475,7.6947137941820456,7.5799937868903395,7.2161741835147746,7.2331017056222358,7.2761784245491929,7.0784641068447414,6.824417009602195,6.7355666429080543,6.7125645438898456]
["I04","Proporção NV <20 anos","A104","R06","ALENTEJO LITORAL ","ULS Litoral Alentejano","I04R06",12.920592193808883,9.6153846153846168,10.539845758354756,8.19277108433735,7.7210460772104614,7.1337579617834397,8.6792452830188669,7.0828331332533008,7.192575406032482,6.0901339829476253,4.5454545454545459,4.9333333333333336,3.9263803680981599,4.4359949302915087,5.0970873786407767,4.441776710684274,3.6363636363636362,4.954954954954955,2.6438569206842923,2.4251069900142657,2.2058823529411766,10.995219469795741,9.4221105527638205,8.7930319369556198,7.6923076923076925,7.847251363827108,7.6253626191462907,7.6305220883534144,6.7965023847376793,6.0057589469354173,5.2177662785683481,4.4530912235192393,4.4180118946474085,4.4892915980230645,4.6606704824202785,4.408735063864853,4.3190832966064345,3.7518037518037519,3.3333333333333335,2.4209486166007905]
["I05","NV >=35 anos","CT","R01","CONTINENTE","Continente","I05R01",10786,11696,12459,13900,14974,14861,15577,15961,16244,16965,17413,17905,19094,19415,21147,22106,21344,20863,22393,24200,26268,34941,38055,41333,43735,45412,46399,47782,49170,50622,52283,54412,56414,59656,62669,64598,null,null,null,null,63815,79608,94974,{"$f":"W32+X32+Y32+Z32+AA32","v":110906},{"$f":"X32+Y32+Z32+AA32+AB32","v":115068}]
["I05","NV >=35 anos","RA","R02","REGIÃO ALENTEJO","Região Alentejo","I05R02",407,462,476,529,610,579,549,637,665,648,648,633,738,740,806,862,892,832,802,949,1057,1345,1467,1615,1718,1738,1765,1851,1950,1961,1929,2019,2111,2284,2409,2561,null,null,null,null,2484,3078,3565,{"$f":"W33+X33+Y33+Z33+AA33","v":4337},{"$f":"X33+Y33+Z33+AA33+AB33","v":4532}]
["I05","NV >=35 anos","A101","R03","ALENTEJO CENTRAL","ACeS Alentejo Central","I05R03",124,164,135,182,181,186,172,193,213,200,215,198,254,259,290,301,313,285,279,337,373,423,481,498,549,539,551,578,606,628,613,667,711,803,850,904,null,null,null,null,786,964,1216,1515,1587]
["I05","NV >=35 anos","A102","R04","ALTO ALENTEJO","ULS Norte Alentejano","I05R04",104,102,104,117,156,133,126,126,143,145,127,138,150,167,145,186,173,191,160,196,212,310,323,377,406,415,385,395,414,415,410,415,455,462,499,505,null,null,null,null,583,673,727,906,932]
["I05","NV >=35 anos","A103","R05","BAIXO ALENTEJO","ULS Baixo Alentejo","I05R05",96,105,142,111,158,146,142,185,159,195,185,185,186,190,216,201,240,207,195,232,279,343,358,411,415,446,473,486,539,539,565,556,561,592,607,657,null,null,null,null,612,827,962,1075,1153]
["I05","NV >=35 anos","A104","R06","ALENTEJO LITORAL ","ULS Litoral Alentejano","I05R06",83,91,95,119,115,114,109,133,150,108,121,112,148,124,155,174,166,149,168,184,193,269,305,329,348,338,356,392,391,379,341,381,384,427,453,495,null,null,null,null,503,614,660,841,860]
["I06","Proporção NV >=35 anos","CT","R01","CONTINENTE","Continente","I06R01",10.404367789481807,11.002925709555122,11.659507566186585,12.707874310894946,13.214140736687904,13.956742644089445,14.397552499260573,15.024663001732058,15.72370267837265,16.403983755559853,17.46311915196614,18.473046169718856,19.275770515965554,20.583308595903482,21.997649090322781,24.106870229007633,25.020514383513472,26.5412309492914,28.594595975074061,29.769226984205087,31.646286368291065,11.02852056662374,11.798646356852082,12.542026241367173,13.286124832157679,13.845586284905897,14.458886330137144,15.038412755363781,15.711222804119362,16.519276078344351,17.424297969059317,18.401393327584167,19.432598706192774,20.605566570183136,22.210329710055042,23.649863256437197,25.160399355272833,26.669529030979589,28.317870786281013,30.032274153061099]
["I06","Proporção NV >=35 anos","RA","R02","REGIÃO ALENTEJO","Região Alentejo","I06R02",9.2647393580696562,9.886582495185106,10.22995916612938,11.284129692832764,12.766848053578903,13.090662446303414,12.084525643847678,13.856863171633673,14.513312963771281,14.464285714285715,15.797172111165287,15.828957239309826,17.621776504297994,18.325903912828132,19.445114595898673,21.075794621026894,22.656845313690628,23.556058890147224,23.609066823667941,26.273532668881504,28.887674227931125,9.8039215686274517,10.468103325246183,11.43848714498194,12.369501043991649,12.645518044237486,13.013345130133452,13.489287275907301,14.276301339775971,14.896687936797326,15.332644463874095,16.429327040442672,17.267893660531698,18.462533344111229,19.620304733968872,21.031876437725927,22.372177524007267,23.246824958586416,24.504316478512475,26.321709786276713]
["I06","Proporção NV >=35 anos","A101","R03","ALENTEJO CENTRAL","ACeS Alentejo Central","I06R03",8.3445491251682373,10.218068535825545,8.7378640776699026,11.607142857142858,11.369346733668342,12.550607287449392,11.22715404699739,12.285168682367917,13.662604233483004,13.679890560875513,14.705882352941178,14.601769911504425,17.988668555240793,19.81637337413925,21.969696969696969,22.067448680351905,24.282389449185416,24.739583333333336,25.317604355716878,28.462837837837839,30.374592833876225,9.1242450388265741,10.194997880457821,10.584484590860786,11.826798793623439,11.702127659574469,12.017448200654307,12.398112398112399,13.196864111498257,14.008476466651794,14.322429906542055,15.768321513002364,17.447852760736197,19.88115870264917,21.297920320721627,22.753586710294488,23.626806833114323,24.753034151848716,26.207097149505525,28.144564598747866]
["I06","Proporção NV >=35 anos","A102","R04","ALTO ALENTEJO","ULS Norte Alentejano","I06R04",9.8484848484848477,9.2057761732851997,9.6744186046511622,10.138648180242635,13.600697471665214,12.85024154589372,11.977186311787072,12.413793103448276,14.606741573033707,14.514514514514515,14.923619271445359,17.206982543640898,16.741071428571427,18.998862343572238,15.864332603938729,21.20866590649943,21.097560975609756,24.085750315258512,22.377622377622377,25.160462130937098,29.001367989056089,9.5708552022229085,9.6793527120167813,11.167061611374407,12.170263788968825,12.832405689548546,12.411347517730496,12.967826657912015,13.832275309054459,14.669494521032167,15.460030165912519,16.280894468418989,17.656189367481566,17.181108218668651,18.651685393258425,19.302949061662197,22.08835341365462,22.508591065292098,23.917796239615218,25.528089887640448]
["I06","Proporção NV >=35 anos","A103","R05","BAIXO ALENTEJO","ULS Baixo Alentejo","I06R05",8.6642599277978327,8.898305084745763,11.314741035856574,9.77112676056338,12.7831715210356,13.02408563782337,12.199312714776632,15.704584040747029,13.451776649746192,16.277128547579299,17.77137367915466,16.956920256645279,17.464788732394364,17.873941674506113,19.871205151793927,19.783464566929133,22.684310018903592,22.475570032573287,20.811099252934898,24.472573839662449,27.352941176470591,9.6810612475303408,10.025203024362924,11.331679073614557,11.880904666475809,12.666856006816246,13.658677447300031,13.791146424517594,15.148960089938168,15.755627009646304,16.966966966966968,17.391304347826086,17.42777260018639,18.413685847589427,19.172457359444092,20.78456184751661,21.636060100166947,22.016460905349795,22.594440484675697,24.302925989672978]
["I06","Proporção NV >=35 anos","A104","R06","ALENTEJO LITORAL ","ULS Litoral Alentejano","I06R06",11.170928667563929,11.666666666666666,12.210796915167094,14.337349397590362,14.32129514321295,14.522292993630574,13.710691823899371,15.966386554621847,17.40139211136891,13.15468940316687,16.176470588235293,14.933333333333335,18.159509202453989,15.716096324461343,18.810679611650485,20.888355342136855,21.558441558441558,22.372372372372375,26.127527216174183,26.248216833095579,28.382352941176471,11.690569317687961,12.772194304857621,13.645790128577353,14.392059553349876,14.183801930339907,14.75341898052217,15.742971887550199,15.54054054054054,15.590292060880294,14.704614057783527,16.472114137483786,16.312659303313509,17.586490939044481,18.520032706459524,20.395550061804695,21.551344204495372,23.232323232323232,24.925373134328357,26.926877470355731]
["I07","Nascimentos pré-termo","CT","R01","CONTINENTE","Continente","I07R01","na","na","na","na",6726,6041,7001,7347,7050,6814,7900,8801,8922,8289,7452,6890,6678,6225,6115,6520,6525,null,null,null,null,19768,20389,21398,21211,21764,23515,25623,26012,24663,22631,21020,null,null,null,null,null,34253,41364,{"$f":"W44+X44+Y44+Z44+AA44","v":32428},{"$f":"X44+Y44+Z44+AA44+AB44","v":32063}]
["I07","Nascimentos pré-termo","RA","R02","REGIÃO ALENTEJO","Região Alentejo","I07R02","na","na","na","na",295,258,307,308,306,322,303,396,354,326,324,266,273,264,233,272,273,null,null,null,null,860,873,921,936,931,1021,1053,1076,1004,916,863,null,null,null,null,null,1501,1703,{"$f":"W45+X45+Y45+Z45+AA45","v":1308},{"$f":"X45+Y45+Z45+AA45+AB45","v":1315}]
["I07","Nascimentos pré-termo","A101","R03","ALENTEJO CENTRAL","ACeS Alentejo Central","I07R03","na","na","na","na",85,99,121,99,99,107,94,131,119,104,102,80,94,79,89,98,97,null,null,null,null,305,319,319,305,300,332,344,354,325,286,276,null,null,null,null,null,525,550,440,457]
["I07","Nascimentos pré-termo","A102","R04","ALTO ALENTEJO","ULS Norte Alentejano","I07R04","na","na","na","na",76,54,59,70,54,70,61,82,57,67,62,61,56,61,48,41,46,null,null,null,null,189,183,183,194,185,213,200,206,186,190,179,null,null,null,null,null,307,329,267,252]
["I07","Nascimentos pré-termo","A103","R05","BAIXO ALENTEJO","ULS Baixo Alentejo","I07R05","na","na","na","na",90,65,80,85,78,91,70,111,108,93,97,69,68,75,59,70,82,null,null,null,null,235,230,243,254,239,272,289,312,298,259,234,null,null,null,null,null,399,479,341,354]
["I07","Nascimentos pré-termo","A104","R06","ALENTEJO LITORAL ","ULS Litoral Alentejano","I07R06","na","na","na","na",44,40,47,54,75,54,78,72,70,62,63,56,55,49,37,63,48,null,null,null,null,131,141,176,183,207,204,220,204,195,181,174,null,null,null,null,null,270,345,260,252]
["I08","Proporção nascimentos pré-termo","CT","R01","CONTINENTE","Continente","I08R01","na","na","na","na",5.9355089217953019,5.6734191718554827,6.4709035788228331,6.9159951803599666,6.8241876312809149,6.5886675691355627,7.9227382588027639,9.0802166623678104,9.0069354008298248,8.7877952588948727,7.7517605816941115,7.5136314067611769,7.8282887487398316,7.9192428058926803,7.8085095515374405,8.020469418885007,7.8609722305885184,null,null,null,null,6.027031394345542,6.3536333409161028,6.7345853279325727,6.7775217998408746,7.1021596256387838,7.8368182151450725,8.6653477400700041,8.9602006159018419,8.5187590237432396,8.0207118731769906,7.6957153683655575,7.7433766802810515,7.8514102648787905,7.9173838209982792,7.8974811321921283]
["I08","Proporção nascimentos pré-termo","RA","R02","REGIÃO ALENTEJO","Região Alentejo","I08R02","na","na","na","na",6.1741314357471744,5.8331449242595523,6.7576491305304867,6.7000217533173814,6.6783064164120471,7.1874999999999991,7.3866406630911747,9.9024756189047256,8.4527220630372497,8.0733036156513123,7.8166465621230401,6.5036674816625926,6.9342138684277366,7.4745186862967161,6.8589932293199887,7.5304540420819492,7.4610549330418152,null,null,null,null,6.257275902211874,6.4366290643662909,6.7118495846086574,6.8526246430924669,7.0723184442418718,8.1154121294014772,8.5686386199039788,8.8016359918200404,8.1157545873413639,7.463537847307097,7.0900427209990138,6.9469677307725588,7.0863243143751156,7.2953230243809886,7.2928383952006]
["I08","Proporção nascimentos pré-termo","A101","R03","ALENTEJO CENTRAL","ACeS Alentejo Central","I08R03","na","na","na","na",5.3391959798994977,6.6801619433198383,7.8981723237597921,6.3017186505410567,6.3502245028864657,7.3187414500683996,6.4295485636114913,9.6607669616519178,8.4277620396600561,7.9571537872991582,7.7272727272727266,5.8651026392961878,7.2924747866563226,6.8576388888888893,8.0762250453720519,8.2770270270270263,7.8990228013029311,null,null,null,null,6.6217976552323057,6.9574700109051255,6.8425568425568422,6.6419860627177698,6.6919473566807941,7.7570093457943923,8.132387706855793,8.6871165644171793,8.0465461747957416,7.1661237785016292,6.9468915177447768,6.6491458607095932,7.394863110358453,7.7370564281559044,8.0819578827546952]
["I08","Proporção nascimentos pré-termo","A102","R04","ALTO ALENTEJO","ULS Norte Alentejano","I08R04","na","na","na","na",6.6259808195292065,5.2173913043478262,5.6083650190114067,6.8965517241379306,5.5158324821246172,7.0070070070070072,7.1680376028202115,10.224438902743142,6.3616071428571423,7.6222980659840731,6.7833698030634579,6.955530216647662,6.8292682926829276,7.6923076923076925,6.7132867132867133,5.2631578947368416,6.2927496580027356,null,null,null,null,5.8441558441558437,5.8994197292069632,6.0078791858174654,6.4817908453057127,6.5394132202191591,8.0316742081447963,7.8462142016477054,7.9937912301125333,6.9170695425808848,7.1161048689138573,6.8556108770585986,7.1485943775100393,7.0876288659793811,6.5588106689986878,6.0674157303370784]
["I08","Proporção nascimentos pré-termo","A103","R05","BAIXO ALENTEJO","ULS Baixo Alentejo","I08R05","na","na","na","na",7.2815533980582519,5.7983942908117747,6.8728522336769764,7.2156196943972839,6.5989847715736047,7.5959933222036726,6.7243035542747354,10.174152153987167,10.140845070422536,8.7488240827845711,8.9236430542778287,6.7913385826771657,6.4272211720226844,8.1433224755700326,6.2966915688367129,7.3839662447257384,8.0392156862745097,null,null,null,null,6.6742402726498158,6.6416401963615366,6.8955732122587969,7.1388420460933109,6.9862613270973402,8.168168168168167,9.0397247419455731,9.6924510717614165,9.26905132192846,8.1806696146557165,7.4027206580196143,7.0784641068447414,6.927297668038408,7.270135424091233,7.2633390705679872]
["I08","Proporção nascimentos pré-termo","A104","R06","ALENTEJO LITORAL ","ULS Litoral Alentejano","I08R06","na","na","na","na",5.4794520547945202,5.095541401273886,5.9119496855345917,6.4825930372148859,8.700696055684455,6.577344701583435,10.427807486631016,9.6,8.5889570552147241,7.8580481622306717,7.6456310679611645,6.7226890756302522,7.1428571428571423,7.3573573573573565,5.7542768273716955,8.9871611982881596,7.0588235294117645,null,null,null,null,5.4972723457826271,5.8433485288023208,7.068273092369477,7.2734499205087442,8.5150143973673398,8.796895213454075,9.5114569822741029,8.6661002548853023,8.0313014827018119,7.3998364677023716,7.1693448702101357,7.0515645658880564,6.7821067821067826,7.4129353233830848,7.312252964426877]
["I09","Baixo Peso à Nascença","CT","R01","CONTINENTE","Continente","I09R01",6600,6923,7148,8127,8031,7645,7937,7862,7850,7779,7547,7623,7640,7724,8035,7733,7286,6849,6859,7225,7173,20671,22198,23306,23803,23613,23444,23649,23491,23176,22949,22810,22987,23399,23492,23054,null,null,null,null,36829,39073,38569,{"$f":"W56+X56+Y56+Z56+AA56","v":35952},{"$f":"X56+Y56+Z56+AA56+AB56","v":35392}]
["I09","Baixo Peso à Nascença","RA","R02","REGIÃO ALENTEJO","Região Alentejo","I09R02",283,320,335,371,369,339,327,332,375,345,361,325,359,347,390,346,324,324,278,328,336,938,1026,1075,1079,1035,998,1034,1052,1081,1031,1045,1031,1096,1083,1060,null,null,null,null,1678,1718,1782,{"$f":"W57+X57+Y57+Z57+AA57","v":1600},{"$f":"X57+Y57+Z57+AA57+AB57","v":1590}]
["I09","Baixo Peso à Nascença","A101","R03","ALENTEJO CENTRAL","ACeS Alentejo Central","I09R03",86,108,113,128,103,127,119,123,147,117,130,117,134,104,126,122,123,90,111,110,126,307,349,344,358,349,369,389,387,394,364,381,355,364,352,371,null,null,null,null,538,633,611,556,560]
["I09","Baixo Peso à Nascença","A102","R04","ALTO ALENTEJO","ULS Norte Alentejano","I09R04",72,90,85,97,98,81,66,77,62,76,78,57,57,79,76,70,66,77,51,58,55,247,272,280,276,245,224,205,215,216,211,192,193,212,225,212,null,null,null,null,442,362,347,322,307]
["I09","Baixo Peso à Nascença","A103","R05","BAIXO ALENTEJO","ULS Baixo Alentejo","I09R05",69,71,80,91,108,71,76,71,88,87,79,89,100,99,112,80,77,91,58,82,105,220,242,279,270,255,218,235,246,254,255,268,288,311,291,269,null,null,null,null,419,393,479,388,413]
["I09","Baixo Peso à Nascença","A104","R06","ALENTEJO LITORAL ","ULS Litoral Alentejano","I09R06",56,51,57,55,60,60,66,61,78,65,74,62,68,65,76,74,58,66,58,78,50,164,163,172,175,186,187,205,204,217,201,204,195,209,215,208,null,null,null,null,279,330,345,334,310]
["I10","Proporção de Baixo Peso à Nascença","CT","R01","CONTINENTE","Continente","I10R01",6.3664776015742568,6.5127611736704951,6.6893137557670528,7.4299924118448368,7.0871353183077703,7.1798194949238825,7.3360322389825496,7.4007831915053846,7.5985635327028618,7.5217559466254107,7.5687222328081587,7.8648439515088988,7.7127310538376888,8.1887960646283027,8.3582120603746901,8.4329334787350057,8.5410170445220732,8.7130753377604755,8.7585555215037285,8.8877134281356103,8.6416480934883442,6.524442592732874,6.882311176702208,7.071939215186493,7.231042171712569,7.1993268066916878,7.3056344128911226,7.4430417992465374,7.5060470793485452,7.5629319740766601,7.6481880169833829,7.7140296589391104,7.9181966614537762,8.0821652838895535,8.3258611340494841,8.4403911561512643,8.5551539051374732,8.6671840940616942,8.7876243650560433,8.7618348865870601]
["I10","Proporção de Baixo Peso à Nascença","RA","R02","REGIÃO ALENTEJO","Região Alentejo","I10R02",6.4420669246528561,6.8478493473143596,7.1996561358263484,7.9138225255972694,7.7228966094600251,7.6644811214108071,7.1978868589038081,7.2221013704589954,8.1841990397206459,7.7008928571428577,8.8005850804485615,8.1270317579394842,8.5721107927411655,8.5933630510153538,9.408926417370326,8.4596577017114907,8.2296164592329184,9.1732729331823339,8.1836914924933772,9.0808416389811732,9.1828368406668481,6.8372330344777312,7.3212501783930346,7.6138536723563996,7.7687378500971986,7.5305587892898718,7.3582540735825406,7.5353447019384925,7.7018815433047809,8.2117897295654814,8.194897067005801,8.5035397509968256,8.4335378323108383,8.859429310484197,8.8242483500366653,8.7085113374958922,8.5993598062116092,8.5219952144303335,8.8226923441798686,8.8301462317210344]
["I10","Proporção de Baixo Peso à Nascença","A101","R03","ALENTEJO CENTRAL","ACeS Alentejo Central","I10R03",5.7873485868102286,6.7289719626168223,7.3139158576051786,8.1632653061224492,6.4698492462311563,8.5695006747638338,7.7676240208877285,7.8294080203691916,9.4291212315586925,8.0027359781121756,8.891928864569083,8.6283185840707954,9.4900849858356935,7.9571537872991582,9.5454545454545467,8.9442815249266872,9.5422808378588044,7.8125,10.072595281306715,9.2905405405405403,10.260586319218241,6.6220880069025014,7.3972022043238663,7.3113708820403831,7.7121930202498925,7.5770733825445067,8.0479825517993451,8.3440583440583449,8.4277003484320563,8.788757528440776,8.5046728971962615,9.0070921985815602,8.7116564417177909,9.0121317157712308,8.8198446504635424,9.338031714069972,8.804204993429698,9.144792548687553,9.0459569517161142,9.8747865680136595]
["I10","Proporção de Baixo Peso à Nascença","A102","R04","ALTO ALENTEJO","ULS Norte Alentejano","I10R04",6.8181818181818175,8.1227436823104693,7.9069767441860463,8.4055459272097046,8.5440278988666094,7.8260869565217401,6.2737642585551328,7.5862068965517242,6.3329928498467831,7.6076076076076085,9.1656874265569908,7.1072319201995011,6.3616071428571423,8.9874857792946532,8.3150984682713336,7.9817559863169896,8.0487804878048781,9.7099621689785636,7.1328671328671325,7.4454428754813868,7.5239398084815319,7.6258104353195426,8.1510338627509746,8.293838862559241,8.2733812949640289,7.5757575757575761,7.2211476466795617,6.7301378857518053,7.1834279986635483,7.6352067868504774,7.9562594268476614,7.5323656335817972,7.4893286767559175,7.883971736705095,8.4269662921348321,8.1194944465721957,8.5542168674698793,8.3333333333333321,8.1329252295583725,7.3707865168539328]
["I10","Proporção de Baixo Peso à Nascença","A103","R05","BAIXO ALENTEJO","ULS Baixo Alentejo","I10R05",6.2274368231046928,6.0169491525423728,6.3745019920318722,8.01056338028169,8.7378640776699026,6.3336306868867087,6.5292096219931279,6.0271646859083194,7.4450084602368864,7.2621035058430721,7.5888568683957729,8.1576535288725935,9.3896713615023462,9.313264346190028,10.303587856485741,7.8740157480314963,7.2778827977315688,9.8805646036916404,6.1899679829242267,8.6497890295358655,10.294117647058822,6.2094270392322892,6.7768132175861098,7.6923076923076925,7.7297452046951047,7.2422607213859695,6.2951198382904998,6.6685584562996603,6.9139966273187179,7.4247296112247883,7.6576576576576567,8.3828589302471066,8.9468779123951538,9.6734059097978236,9.1914087176247641,8.5099652008857962,8.2804674457429055,7.7503429355281206,8.2323592302209558,8.4337349397590362]
["I10","Proporção de Baixo Peso à Nascença","A104","R06","ALENTEJO LITORAL ","ULS Litoral Alentejano","I10R06",7.5370121130551819,6.5384615384615392,7.3264781491002573,6.6265060240963862,7.4719800747198004,7.6433121019108281,8.3018867924528301,7.3229291716686671,9.0487238979118327,7.917174177831912,9.8930481283422473,8.2666666666666657,8.3435582822085887,8.2382762991128011,9.2233009708737868,8.8835534213685481,7.5324675324675319,9.9099099099099099,9.0202177293934671,11.126961483594865,7.3529411764705888,7.1273359408952626,6.8257956448911221,7.1339693073413519,7.2373862696443343,7.8052874527906004,7.7496891835888944,8.2329317269076299,8.1081081081081088,8.9263677498971621,8.6675291073738681,8.8197146562905324,8.2837723024638912,8.6079077429983517,8.7898609975470148,8.5702513391017714,8.7263111502864703,8.7542087542087543,10.049751243781095,9.1897233201581017]
["I11","Índice sintético de fecundidade (ISF)","CT","R01","CONTINENTE","Continente","I11R01",1.43273764133683,1.4611013039185572,1.4637021530801475,1.4938896550464988,1.5426097879157423,1.4442204917011185,1.4624444371409304,1.4351019148859052,1.402336090443824,1.4135648144842672,1.3742621168427569,1.3502316877831153,1.3827809255730685,1.347474588283234,1.3942369399420746,1.3498754066360792,1.2877062357186866,1.2146438843553757,1.2487321970436993,1.3092241618587122,1.3671414567907798]
["I11","Índice sintético de fecundidade (ISF)","RA","R02","REGIÃO ALENTEJO","Região Alentejo","I11R02",1.2859596145055816,1.372540746974485,1.373741706312408,1.3928736056310318,1.4270982345666559,1.3237471732131325,1.3577297198797247,1.3762893632416635,1.3799755254182491,1.3605629497644305,1.257385165490317,1.2410718359326536,1.3018947762686799,1.2906670895511194,1.3526167146665977,1.3612773054411618,1.3411172216283358,1.230931478497683,1.2656182993225777,1.3290441404849516,1.3875032622281398]
["I11","Índice sintético de fecundidade (ISF)","A101","R03","ALENTEJO CENTRAL","ACeS Alentejo Central","I11R03",1.2994675628459817,1.4000961574167585,1.3485808198541829,1.3689448127659967,1.3876210006360126,1.2959156336045996,1.3333550034355162,1.3773589687784735,1.3715835915232482,1.293929397648558,1.3114747949876813,1.2299684147337193,1.2819984004959122,1.2234259851650513,1.2505012558953312,1.3276018800098575,1.2898363111771878,1.1910840427881895,1.1759279535312657,1.303470373969613,1.3982153769823753]
["I11","Índice sintético de fecundidade (ISF)","A102","R04","ALTO ALENTEJO","ULS Norte Alentejano","I11R04",1.3153824772035156,1.3905701119796645,1.3642512632967618,1.482441132775365,1.4886177799452613,1.3486295418074521,1.370427994520437,1.3277850980923591,1.2892911626420409,1.3298179131105272,1.14560602307866,1.0963320899961588,1.2230412977826728,1.2391815545330229,1.3238427471240264,1.2838877713937282,1.2433737639216165,1.2196986045609908,1.1473140270033977,1.2713889742406308,1.2377280785169731]
["I11","Índice sintético de fecundidade (ISF)","A103","R05","BAIXO ALENTEJO","ULS Baixo Alentejo","I11R05",1.2933439106130318,1.3848231271741342,1.4888140575112154,1.3638289172279223,1.4966374480132765,1.3633213813747629,1.4150562050526312,1.4367141041566365,1.4571534651070706,1.4906754119345942,1.3109832807301611,1.3958399432811128,1.3762670089444009,1.4008033002244387,1.4591528432768339,1.4014910182173508,1.4848600465498467,1.3210619270372035,1.380289116733316,1.4226271941969233,1.5616923756890655]
["I11","Índice sintético de fecundidade (ISF)","A104","R06","ALENTEJO LITORAL ","ULS Litoral Alentejano","I11R06",1.2049038043089144,1.2854373227806482,1.2701681703247043,1.3592075788806253,1.3298226641691271,1.2953667030940355,1.3072133455989989,1.3561340968500726,1.4035615138774209,1.3385002755433206,1.2239693215836072,1.2333583414425109,1.3335716759515417,1.3256383868817556,1.4315417009283249,1.4610342356505519,1.3576791661803445,1.1977717739709604,1.1676049829450816,1.3117124070149215,1.3180158508474482]
["I12","Óbitos","CT","R01","CONTINENTE","Continente","I12R01",101466,99355,100844,102665,100021,99706,100880,103321,96946,102323,97038,98668,99401,99335,100837,97962,102808,101655,99737,103614,105512,301665,302864,303530,302392,300607,303907,301147,302590,296307,298029,295107,297404,299573,298134,301607,null,null,null,null,504351,503176,495279,{"$f":"X74+Y74+Z74+AA74+AB74","v":513326},{"$f":"X74+Y74+Z74+AA74+AB74","v":513326}]
["I12","Óbitos","RA","R02","REGIÃO ALENTEJO","Região Alentejo","I12R02",7969,7649,7838,7889,7550,7455,7572,7962,7074,7894,7081,7271,7538,7378,7468,7217,7492,7136,6983,7464,7384,23456,23376,23277,22894,22577,22989,22608,22930,22049,22246,21890,22187,22384,22063,22177,null,null,null,null,38895,37957,36736,{"$f":"X75+Y75+Z75+AA75+AB75","v":36459},{"$f":"X75+Y75+Z75+AA75+AB75","v":36459}]
["I12","Óbitos","A101","R03","ALENTEJO CENTRAL","ACeS Alentejo Central","I12R03",2250,2223,2294,2234,2170,2131,2181,2302,2015,2303,2135,2171,2295,2227,2238,2025,2199,2156,2159,2194,2266,6767,6751,6698,6535,6482,6614,6498,6620,6453,6609,6601,6693,6760,6490,6462,null,null,null,null,11171,10932,11066,10974,10974]
["I12","Óbitos","A102","R04","ALTO ALENTEJO","ULS Norte Alentejano","I12R04",2096,1994,1979,2036,1972,1993,1927,2069,1830,2044,1798,1864,1852,1893,1914,1887,1936,1843,1839,1905,1905,6069,6009,5987,6001,5892,5989,5826,5943,5672,5706,5514,5609,5659,5694,5737,null,null,null,null,10077,9863,9321,9428,9428]
["I12","Óbitos","A103","R05","BAIXO ALENTEJO","ULS Baixo Alentejo","I12R05",2297,2123,2252,2297,2164,2060,2224,2226,1985,2135,1945,1986,2097,1976,2059,2006,2018,1900,1799,2003,1920,6672,6672,6713,6521,6448,6510,6435,6346,6065,6066,6028,6059,6132,6041,6083,null,null,null,null,11133,10630,10063,9640,9640]
["I12","Óbitos","A104","R06","ALENTEJO LITORAL ","ULS Litoral Alentejano","I12R06",1326,1309,1313,1322,1244,1271,1240,1365,1244,1412,1203,1250,1294,1282,1257,1299,1339,1237,1186,1362,1293,3948,3944,3879,3837,3755,3876,3849,4021,3859,3865,3747,3826,3833,3838,3895,null,null,null,null,6514,6532,6286,6417,6417]
["I13","Taxa Bruta de Mortalidade","CT","R01","CONTINENTE","  ","I13R01",10.591275772433184,10.321375458978128,10.420296162746913,10.546231405673506,10.200667728095262,10.097142437599212,10.162100000785729,10.370855888455157,9.7096139760912301,10.231222140747473,9.6872928529785245,9.8327011755931615,9.8932426349082832,9.8786389784332709,10.024623390665301,9.7528160606764889,10.276886047948638,10.219049351459049,10.080385253309135,10.514425369666318,10.739925187370021]
["I13","Taxa Bruta de Mortalidade","RA","R02","REGIÃO ALENTEJO","Região Alentejo","I13R02",14.727910675194034,14.183358242442898,14.572714367919204,14.703730729194334,14.09285417629134,13.933238202303892,14.186549756906388,14.974778726109379,13.360971947436266,14.978331322054995,13.502587630477977,13.929705849671825,14.521944260624398,14.300112416172423,14.566434978168877,14.182613181360386,14.857046537338443,14.288660578234222,14.152286547829075,15.346451698461962,15.365838685746333]
["I13","Taxa Bruta de Mortalidade","A101","R03","ALENTEJO CENTRAL","ACeS Alentejo Central","I13R03",12.971664120377042,12.822990242875397,13.236397207316369,12.891386891640796,12.510413333679244,12.282633129103097,12.590815805197391,13.325267938027665,11.696890890937377,13.414023275048635,12.484467509684965,12.742554615140808,13.537307226090727,13.211324840197546,13.357525694436156,12.173750988177936,13.340694274239537,13.214751978228756,13.402321041147422,13.815816402031441,14.435281714141926]
["I13","Taxa Bruta de Mortalidade","A102","R04","ALTO ALENTEJO","ULS Norte Alentejano","I13R04",16.099855976956313,15.41631392377661,15.387725586856286,15.91482908755501,15.484337027745388,15.714319506098859,15.262882760150173,16.482444085957262,14.671279167184437,16.494911916847567,14.610106000463167,15.250812040287016,15.266986789769799,15.726705907276404,16.032970622973888,15.976970133141418,16.616599433525021,16.040034812880766,16.258437545585952,17.137536602809476,17.411332446772047]
["I13","Taxa Bruta de Mortalidade","A103","R05","BAIXO ALENTEJO","ULS Baixo Alentejo","I13R05",16.626373467290126,15.465306865780367,16.491282028749897,16.911902754718508,16.000650673410011,15.278328877154078,16.566169706404867,16.679592226680604,14.962386745662039,16.188161790630581,14.839285578045487,15.241164959134339,16.204437094792478,15.382998516973069,16.149969606055258,15.867930722164871,16.107596831161576,15.304807320530996,14.65837193479917,16.554608305404834,16.056733792734331]
["I13","Taxa Bruta de Mortalidade","A104","R06","ALENTEJO LITORAL ","ULS Litoral Alentejano","I13R06",13.355491766127814,13.180284951920658,13.212113284060436,13.288569016123194,12.480186199562592,12.723232161447907,12.397520495900819,13.656076954244639,12.466803627799768,14.185465925245005,12.118586870019845,12.616577173079254,13.093389052753002,13.008559063627278,12.791549639760655,13.255778356038572,13.712799295414047,12.723457653617494,12.29168393997181,14.275233204066659,13.670605027357068]
["I14","Óbitos Infantis","CT","R01","CONTINENTE","Continente","I14R01",683,664,624,592,597,514,534,432,388,353,326,329,324,338,236,285,283,226,215,233,269,1971,1880,1813,1703,1645,1480,1354,1173,1067,1008,979,991,898,859,804,null,null,null,null,3160,2221,1553,{"$f":"W86+X86+Y86+Z86+AA86","v":1242},{"$f":"X86+Y86+Z86+AA86+AB86","v":1226}]
["I14","Óbitos Infantis","RA","R02","REGIÃO ALENTEJO","Região Alentejo","I14R02",23,24,21,19,25,16,22,25,20,16,14,16,17,24,9,8,15,10,8,14,5,68,64,65,60,63,63,67,61,50,46,47,57,50,41,32,null,null,null,null,112,99,80,{"$f":"W87+X87+Y87+Z87+AA87","v":55},{"$f":"X87+Y87+Z87+AA87+AB87","v":52}]
["I14","Óbitos Infantis","A101","R03","ALENTEJO CENTRAL","ACeS Alentejo Central","I14R03",8,13,4,6,6,5,7,8,7,4,2,5,1,6,4,2,5,3,1,4,1,25,23,16,17,18,20,22,19,13,11,8,12,11,12,11,null,null,null,null,37,31,18,15,14]
["I14","Óbitos Infantis","A102","R04","ALTO ALENTEJO","ULS Norte Alentejano","I14R04",2,4,6,8,4,2,4,3,4,5,5,5,5,4,0,2,3,1,3,2,0,12,18,18,14,10,9,11,12,14,15,15,14,9,6,5,null,null,null,null,24,18,19,11,9]
["I14","Óbitos Infantis","A103","R05","BAIXO ALENTEJO","ULS Baixo Alentejo","I14R05",6,5,6,2,11,3,5,5,7,3,5,3,8,8,5,3,3,5,2,6,3,17,13,19,16,19,13,17,15,15,11,16,19,21,16,11,null,null,null,null,30,23,29,19,19]
["I14","Óbitos Infantis","A104","R06","ALENTEJO LITORAL ","ULS Litoral Alentejano","I14R06",7,2,5,3,4,6,6,9,2,4,2,3,3,6,0,1,4,1,2,2,1,14,10,12,13,16,21,17,15,8,9,8,12,9,7,5,null,null,null,null,21,27,14,10,10]
["I15","Taxa de Mortalidade Infantil","CT","R01","CONTINENTE","Continente","I15R01",6.5883396998109349,6.2465310115805419,5.8395799994385014,5.4122745266545378,5.268359836919112,4.827242930530903,4.9356699201419696,4.066571277957677,3.7557231218964464,3.413266292786695,3.2693831295819002,3.3943770956925459,3.270844059480905,3.5833934099486875,2.4549322293073139,3.1079607415485277,3.3174688767495839,2.8750985929827242,2.7454285422412914,2.8662106972395809,3.2407686283958799,6.2211196121505949,5.8287886351023293,5.5013411984609597,5.173492760755579,5.0154121022351354,4.6119855532668748,4.261439636424293,3.7480708458881455,3.4818986953485491,3.3593505255650573,3.3108439439287105,3.4136394011835787,3.1017498290238121,3.0444043564398542,2.9435562113063312,3.1062704411373487,2.9889688883017369,2.8294362117459384,2.9553726366293085]
["I15","Taxa de Mortalidade Infantil","RA","R02","REGIÃO ALENTEJO","Região Alentejo","I15R02",5.2356020942408383,5.135887010485769,4.513217279174726,4.0529010238907848,5.2323147760569277,3.6174542165950712,4.8426150121065374,5.4383293452251467,4.3649061545176782,3.5714285714285712,3.4129692832764507,4.0010002500625159,4.059216809933142,5.9435364041604748,2.1712907117008444,1.9559902200488997,3.8100076200152397,2.8312570781426953,2.3550191345304681,3.8759689922480618,1.3664935774801859,4.9566294919454768,4.5668617097188529,4.6037254763085205,4.3199654402764782,4.583818393480791,4.6449900464498999,4.8826701646990234,4.4659199062888932,3.7982376177453658,3.6563071297989032,3.8245585482952236,4.6625766871165641,4.0417104518632287,3.3406665037073249,2.6289845547157413,2.8549182455229691,3.0369961347321923,3.0357651076747936,2.5309336332958381]
["I15","Taxa de Mortalidade Infantil","A101","R03","ALENTEJO CENTRAL","ACeS Alentejo Central","I15R03",5.3835800807537009,8.0996884735202492,2.5889967637540452,3.8265306122448979,3.7688442211055273,3.3738191632928478,4.5691906005221936,5.0922978994271162,4.490057729313663,2.7359781121751023,1.3679890560875512,3.6873156342182889,0.708215297450425,4.5906656465187456,3.0303030303030303,1.466275659824047,3.8789759503491079,2.6041666666666665,0.90744101633393826,3.3783783783783785,0.81433224755700329,5.392579810181191,4.8749470114455278,3.4006376195536663,3.6622145626884963,3.9079461571862786,4.3620501635768809,4.7190047190047189,4.1376306620209053,2.8998438545616776,2.5700934579439254,1.8912529550827422,2.94478527607362,2.723446397623174,3.0067652217489349,2.7686886483765418,2.6281208935611038,2.5402201524132089,2.326934264107039,1.707455890722823]
["I15","Taxa de Mortalidade Infantil","A102","R04","ALTO ALENTEJO","ULS Norte Alentejano","I15R04",1.893939393939394,3.6101083032490977,5.5813953488372094,6.932409012131715,3.4873583260680037,1.932367149758454,3.8022813688212929,2.9556650246305423,4.0858018386108279,5.005005005005005,5.8754406580493539,6.2344139650872821,5.5803571428571432,4.5506257110352673,0,2.2805017103762828,3.6585365853658538,1.2610340479192939,4.1958041958041958,2.5673940949935812,0,3.7048471750540286,5.394066526820497,5.3317535545023702,4.1966426858513186,3.0921459492888066,2.9013539651837523,3.6112934996717003,4.0093551620447707,4.9487451396253093,5.6561085972850673,5.8846606512357784,5.4326736515327898,3.3469691335068799,2.2471910112359552,1.9149751053236308,2.4096385542168677,3.006872852233677,2.6235242675994757,2.2471910112359552]
["I15","Taxa de Mortalidade Infantil","A103","R05","BAIXO ALENTEJO","ULS Baixo Alentejo","I15R05",5.4151624548736459,4.2372881355932206,4.7808764940239037,1.7605633802816902,8.89967637540453,2.6761819803746651,4.2955326460481107,4.2444821731748732,5.9221658206429781,2.5041736227045073,4.8030739673390972,2.7497708524289641,7.511737089201878,7.5258701787394173,4.5998160073597054,2.9527559055118111,2.8355387523629489,5.4288816503800215,2.1344717182497335,6.3291139240506329,2.9411764705882351,4.798193621224951,3.6404368524222908,5.2384891094568511,4.5805897509304323,5.3961942629934683,3.7539705457695636,4.8240635641316683,4.2158516020236085,4.3846828412744818,3.303303303303303,5.0046918986549898,5.9024541783162467,6.5318818040435458,5.0536955148452298,3.4799114204365704,3.672787979966611,3.4293552812071328,4.6329294369208842,3.7865748709122204]
["I15","Taxa de Mortalidade Infantil","A104","R06","ALENTEJO LITORAL ","ULS Litoral Alentejano","I15R06",9.4212651413189779,2.5641025641025643,6.4267352185089974,3.6144578313253013,4.9813200498132009,7.6433121019108281,7.5471698113207548,10.804321728691477,2.3201856148491879,4.8721071863580994,2.6737967914438503,4,3.6809815950920246,7.6045627376425857,0,1.2004801920768307,5.1948051948051948,1.5015015015015014,3.1104199066874028,2.8530670470756063,1.4705882352941175,6.0843111690569316,4.1876046901172526,4.9771878888428045,5.3763440860215059,6.714225765841376,8.7028595109821811,6.8273092369477917,5.9618441971383156,3.2908268202385851,3.8809831824062098,3.4587116299178553,5.0977060322854717,3.7067545304777596,2.8618152085036792,2.0601565718994643,2.644336712208021,3.3670033670033668,2.4875621890547261,2.4703557312252964]
["I16","Óbitos Neonatais","CT","R01","CONTINENTE","Continente","I16R01",414,425,389,378,368,300,363,281,256,222,211,198,206,228,157,215,188,147,157,163,193,1228,1192,1135,1046,1031,944,900,759,689,631,615,632,591,600,560,null,null,null,null,1974,1422,1000,{"$f":"W98+X98+Y98+Z98+AA98","v":870},{"$f":"X98+Y98+Z98+AA98+AB98","v":848}]
["I16","Óbitos Neonatais","RA","R02","REGIÃO ALENTEJO","Região Alentejo","I16R02",13,19,13,12,12,12,16,15,18,11,10,9,8,15,5,7,14,5,6,7,3,45,44,37,36,40,43,49,44,39,30,27,32,28,27,26,null,null,null,null,69,72,47,{"$f":"W99+X99+Y99+Z99+AA99","v":39},{"$f":"X99+Y99+Z99+AA99+AB99","v":35}]
["I16","Óbitos Neonatais","A101","R03","ALENTEJO CENTRAL","ACeS Alentejo Central","I16R03",4,9,2,4,4,4,4,5,6,4,1,4,1,3,2,2,5,1,1,1,1,15,15,10,12,12,13,15,15,11,9,6,8,6,7,9,null,null,null,null,23,23,11,10,9]
["I16","Óbitos Neonatais","A102","R04","ALTO ALENTEJO","ULS Norte Alentejano","I16R04",2,3,4,5,3,2,3,2,4,3,4,3,3,3,0,1,2,0,3,2,0,9,12,12,10,8,7,9,9,11,10,10,9,6,4,3,null,null,null,null,17,14,13,8,7]
["I16","Óbitos Neonatais","A103","R05","BAIXO ALENTEJO","ULS Baixo Alentejo","I16R05",4,5,4,2,5,1,5,3,6,2,3,1,2,6,3,3,3,3,0,4,1,13,11,11,8,11,9,14,11,11,6,6,9,11,12,9,null,null,null,null,20,17,15,13,11]
["I16","Óbitos Neonatais","A104","R06","ALENTEJO LITORAL ","ULS Litoral Alentejano","I16R06",3,2,3,1,0,5,4,5,2,2,2,1,2,3,0,1,4,1,2,0,1,8,6,4,6,9,14,11,9,6,5,5,6,5,4,5,null,null,null,null,9,18,8,8,8]
["I17","Taxa de Mortalidade Neonatal","CT","R01","CONTINENTE","Continente","I17R01",3.9935177682602152,3.9981561444604368,3.6403791983679126,3.4558104241138774,3.2474981909317142,2.8174569633448852,3.3551464063886427,2.6451540025604339,2.4780028845502331,2.1465867337072133,2.1160731298827633,2.0428166107815318,2.0796107291761308,2.4172002883677539,1.6331540678018994,2.3446019629225736,2.2038309145898296,1.8700862529577895,2.0048013075901521,2.0051173547212517,2.3251611348713932,3.8759689922480618,3.695700028213817,3.4440277221473741,3.1776121125956172,3.1433981017656079,2.9416988934350878,2.8325669666040354,2.4252223120452712,2.2483863178023902,2.1029267674916183,2.0798457870440825,2.177013220532817,2.0413520589677874,2.1264756855225992,2.050238157128788,2.151698668294133,2.0311777528238326,1.9604550606607614,2.1145134764167861]
["I17","Taxa de Mortalidade Neonatal","RA","R02","REGIÃO ALENTEJO","Região Alentejo","I17R02",2.9592533576143869,4.0659105499679011,2.7938964109176876,2.5597269624573378,2.5115110925073254,2.7130906624463034,3.5219018269865727,3.2629976071350879,3.9284155390659103,2.4553571428571428,2.4378352023403216,2.2505626406601649,1.9102196752626552,3.7147102526002969,1.2062726176115801,1.7114914425427872,3.5560071120142243,1.4156285390713477,1.7662643508978511,1.9379844961240309,0.81989614648811149,3.2801224579050952,3.1397174254317113,2.6205821942063885,2.5919792641658868,2.9103608847497093,3.1703900317039002,3.570908030899286,3.221319276667399,2.9626253418413855,2.3845481281297194,2.1970868256164051,2.6175869120654394,2.263357853043408,2.1999511121975068,2.1360499507065396,2.2493295267756728,2.3007546475243883,1.7076178730670715,1.4998125234345707]
["I17","Taxa de Mortalidade Neonatal","A101","R03","ALENTEJO CENTRAL","ACeS Alentejo Central","I17R03",2.6917900403768504,5.6074766355140184,1.2944983818770226,2.5510204081632653,2.512562814070352,2.6990553306342777,2.6109660574412534,3.1826861871419481,3.8486209108402822,2.7359781121751023,0.68399452804377558,2.9498525073746311,0.708215297450425,2.2953328232593728,1.5151515151515151,1.466275659824047,3.8789759503491079,0.86805555555555547,0.90744101633393826,0.84459459459459463,0.81433224755700329,3.2355478861087144,3.1793132683340399,2.1253985122210413,2.5850926324859973,2.6052974381241856,2.8353326063249726,3.2175032175032174,3.2665505226480835,2.4537140307829577,2.1028037383177569,1.4184397163120568,1.96319018404908,1.4855162168853677,1.7539463793535455,2.2652907123080794,2.1024967148488831,1.9757267852102736,0.87260034904013961,0.8537279453614115]
["I17","Taxa de Mortalidade Neonatal","A102","R04","ALTO ALENTEJO","ULS Norte Alentejano","I17R04",1.893939393939394,2.7075812274368229,3.7209302325581399,4.3327556325823222,2.6155187445510029,1.932367149758454,2.8517110266159698,1.9704433497536944,4.0858018386108279,3.0030030030030028,4.7003525264394828,3.7406483790523688,3.3482142857142856,3.4129692832764507,0,1.1402508551881414,2.4390243902439024,0,4.1958041958041958,2.5673940949935812,0,2.7786353812905218,3.5960443512136648,3.5545023696682461,2.9976019184652278,2.4737167594310452,2.256608639587363,2.9546946815495732,3.0070163715335783,3.8882997525627432,3.7707390648567118,3.9231071008238523,3.4924330616996508,2.2313127556712531,1.4981273408239701,1.1489850631941785,1.2048192771084338,2.1477663230240553,2.1862702229995628,2.2471910112359552]
["I17","Taxa de Mortalidade Neonatal","A103","R05","BAIXO ALENTEJO","ULS Baixo Alentejo","I17R05",3.6101083032490977,4.2372881355932206,3.1872509960159365,1.7605633802816902,4.0453074433656955,0.89206066012488849,4.2955326460481107,2.5466893039049237,5.0761421319796947,1.669449081803005,2.8818443804034581,0.91659028414298815,1.8779342723004695,5.644402634054563,2.7598896044158234,2.9527559055118111,2.8355387523629489,3.2573289902280131,0,4.2194092827004219,0.98039215686274506,3.6692068868190799,3.0803696443573232,3.0328094844223878,2.2902948754652162,3.1241124680488497,2.5989026855327753,3.9727582292849033,3.0916245081506464,3.215434083601286,1.8018018018018018,1.8767594619956209,2.7958993476234855,3.421461897356143,3.790271636133923,2.8472002530844667,3.005008347245409,2.0576131687242798,2.4946543121881684,1.7211703958691911]
["I17","Taxa de Mortalidade Neonatal","A104","R06","ALENTEJO LITORAL ","ULS Litoral Alentejano","I17R06",4.0376850605652761,2.5641025641025643,3.8560411311053984,1.2048192771084338,0,6.369426751592357,5.0314465408805029,6.0024009603841542,2.3201856148491879,2.4360535931790497,2.6737967914438503,1.3333333333333333,2.4539877300613497,3.8022813688212929,0,1.2004801920768307,5.1948051948051948,1.5015015015015014,3.1104199066874028,0,1.4705882352941175,3.4767492394611041,2.512562814070352,1.6590626296142679,2.4813895781637716,3.7767519932857745,5.8019063406547868,4.4176706827309236,3.5771065182829891,2.4681201151789387,2.1561017680034498,2.1616947686986601,2.5488530161427359,2.059308072487644,1.635322976287817,2.0601565718994643,2.644336712208021,3.3670033670033668,1.4925373134328359,1.4822134387351777]
["I18","Óbitos Neonatais Precoces","CT","R01","CONTINENTE","Continente","I18R01",317,291,293,280,277,219,274,216,172,160,154,152,146,151,108,136,128,96,113,108,120,901,864,850,776,770,709,662,548,486,466,452,449,405,395,372,null,null,null,null,1458,1041,711,{"$f":"W110+X110+Y110+Z110+AA110","v":581},{"$f":"X110+Y110+Z110+AA110+AB110","v":565}]
["I18","Óbitos Neonatais Precoces","RA","R02","REGIÃO ALENTEJO","Região Alentejo","I18R02",8,8,9,8,9,9,10,12,15,9,8,7,8,12,4,6,12,4,4,6,2,25,25,26,26,28,31,37,36,32,24,23,27,24,22,22,null,null,null,null,42,55,39,{"$f":"W111+X111+Y111+Z111+AA111","v":32},{"$f":"X111+Y111+Z111+AA111+AB111","v":28}]
["I18","Óbitos Neonatais Precoces","A101","R03","ALENTEJO CENTRAL","ACeS Alentejo Central","I18R03",2,5,2,3,2,2,2,4,6,3,1,3,1,2,2,1,4,1,1,1,0,9,10,7,7,6,8,12,13,10,7,5,6,5,5,7,null,null,null,null,14,17,9,8,7]
["I18","Óbitos Neonatais Precoces","A102","R04","ALTO ALENTEJO","ULS Norte Alentejano","I18R04",1,0,3,2,3,2,2,2,2,3,2,3,3,2,0,1,2,0,2,2,0,4,5,8,7,7,6,6,7,7,8,8,8,5,3,3,null,null,null,null,9,11,10,7,6]
["I18","Óbitos Neonatais Precoces","A103","R05","BAIXO ALENTEJO","ULS Baixo Alentejo","I18R05",3,2,2,2,4,1,3,3,5,1,3,0,2,5,2,3,2,2,0,3,1,7,6,8,7,8,7,11,9,9,4,5,7,9,10,7,null,null,null,null,13,13,12,10,8]
["I18","Óbitos Neonatais Precoces","A104","R06","ALENTEJO LITORAL ","ULS Litoral Alentejano","I18R06",2,1,2,1,0,4,3,3,2,2,2,1,2,3,0,1,4,1,1,0,1,5,4,3,5,7,10,8,7,6,5,5,6,5,4,5,null,null,null,null,6,14,8,7,7]
["I19","Taxa de Mortalidade Neonatal Precoce","CT","R01","CONTINENTE","Continente","I19R01",3.0578384843924837,2.7375610306776172,2.7419822753773735,2.559859573417687,2.4444483665437087,2.056743583241766,2.5325347530316473,2.0332856389788385,1.6649081880571877,1.5470895378070004,1.5444325213362349,1.5682228527211761,1.4738988663092967,1.6008651032611001,1.123443562564364,1.4830970556161396,1.5004806226994585,1.2212808182581483,1.4429461640617021,1.3285440141711362,1.4456960424070839,2.843850213367674,2.6787624365576663,2.5792278095376813,2.3573871886942626,2.3476397074292126,2.2093903765312257,2.0835103687687462,1.7510168998693127,1.5859444854164899,1.5530330802711474,1.5286021069006916,1.5466438861063843,1.3988960810185345,1.3999298263023776,1.3619439186641233,1.4083845828834327,1.391274192482991,1.3307585743671551,1.4055537923160311]
["I19","Taxa de Mortalidade Neonatal Precoce","RA","R02","REGIÃO ALENTEJO","Região Alentejo","I19R02",1.821078989301161,1.7119623368285899,1.9342359767891684,1.7064846416382253,1.8836333193804939,2.0348179968347275,2.201188641866608,2.6103980857080704,3.2736796158882582,2.0089285714285712,1.9502681618722573,1.7504376094023506,1.9102196752626552,2.9717682020802374,0.9650180940892642,1.4669926650366749,3.048006096012192,1.1325028312570782,1.177509567265234,1.6611295681063123,0.54659743099207425,1.8222902543917197,1.7839303553589267,1.8414901905234082,1.8719850241198071,2.037252619324796,2.2856300228563002,2.6963999416994606,2.6356248627278718,2.4308720753570343,1.9076385025037754,1.8715924810806412,2.2085889570552149,1.9400210168943497,1.7925527580868574,1.807426881367072,1.9032788303486461,1.8406037180195105,1.3281472346077221,1.124859392575928]
["I19","Taxa de Mortalidade Neonatal Precoce","A101","R03","ALENTEJO CENTRAL","ACeS Alentejo Central","I19R03",1.3458950201884252,3.1152647975077881,1.2944983818770226,1.9132653061224489,1.256281407035176,1.3495276653171389,1.3054830287206267,2.5461489497135581,3.8486209108402822,2.0519835841313268,0.68399452804377558,2.2123893805309733,0.708215297450425,1.530221882172915,1.5151515151515151,0.73313782991202348,3.1031807602792862,0.86805555555555547,0.90744101633393826,0.84459459459459463,0,1.9413287316652286,2.1195421788893598,1.487778958554729,1.5079707022834985,1.3026487190620928,1.7448200654307524,2.574002574002574,2.8310104529616726,2.2306491188935982,1.6355140186915889,1.1820330969267139,1.47239263803681,1.2379301807378065,1.2528188423953897,1.7618927762396175,1.5768725361366622,1.6934801016088061,0.87260034904013961,0.56915196357427433]
["I19","Taxa de Mortalidade Neonatal Precoce","A102","R04","ALTO ALENTEJO","ULS Norte Alentejano","I19R04",0.94696969696969702,0,2.7906976744186047,1.7331022530329288,2.6155187445510029,1.932367149758454,1.9011406844106464,1.9704433497536944,2.042900919305414,3.0030030030030028,2.3501762632197414,3.7406483790523688,3.3482142857142856,2.2753128555176336,0,1.1402508551881414,2.4390243902439024,0,2.7972027972027971,2.5673940949935812,0,1.2349490583513429,1.4983518130056939,2.3696682464454977,2.0983213429256593,2.1645021645021645,1.9342359767891684,1.969796454366382,2.3387905111927831,2.4743725698126546,3.0165912518853695,3.1384856806590817,3.1043849437330229,1.859427296392711,1.1235955056179776,1.1489850631941785,1.2048192771084338,1.7182130584192439,1.7490161783996503,1.7977528089887642]
["I19","Taxa de Mortalidade Neonatal Precoce","A103","R05","BAIXO ALENTEJO","ULS Baixo Alentejo","I19R05",2.7075812274368229,1.6949152542372881,1.5936254980079683,1.7605633802816902,3.2362459546925568,0.89206066012488849,2.5773195876288661,2.5466893039049237,4.230118443316413,0.8347245409015025,2.8818443804034581,0,1.8779342723004695,4.7036688617121349,1.8399264029438822,2.9527559055118111,1.890359168241966,2.1715526601520088,0,3.1645569620253164,0.98039215686274506,1.9757267852102736,1.6802016241949034,2.2056796250344637,2.0040080160320639,2.2720817949446181,2.0213687554143807,3.1214528944381383,2.5295109612141653,2.630809704764689,1.2012012012012012,1.5639662183296841,2.1745883814849334,2.7993779160186625,3.1585596967782692,2.2144890857323629,2.337228714524207,1.371742112482853,1.7818959372772631,1.376936316695353]
["I19","Taxa de Mortalidade Neonatal Precoce","A104","R06","ALENTEJO LITORAL ","ULS Litoral Alentejano","I19R06",2.6917900403768504,1.2820512820512822,2.5706940874035986,1.2048192771084338,0,5.0955414012738851,3.7735849056603774,3.601440576230492,2.3201856148491879,2.4360535931790497,2.6737967914438503,1.3333333333333333,2.4539877300613497,3.8022813688212929,0,1.2004801920768307,5.1948051948051948,1.5015015015015014,1.5552099533437014,0,1.4705882352941175,2.1729682746631895,1.6750418760469012,1.2442969722107011,2.0678246484698097,2.9374737725556024,4.1442188147534189,3.2128514056224899,2.7821939586645468,2.4681201151789387,2.1561017680034498,2.1616947686986601,2.5488530161427359,2.059308072487644,1.635322976287817,2.0601565718994643,2.644336712208021,2.8860028860028861,0.99502487562189046,0.98814229249011853]
["I20","Óbitos Pós-Neonatais","CT","R01","CONTINENTE","Continente","I20R01",269,239,235,214,229,214,171,151,132,131,115,131,118,110,79,70,95,79,58,70,76,743,688,678,657,614,536,454,414,378,377,364,359,307,259,244,null,null,null,null,1186,799,553,{"$f":"W122+X122+Y122+Z122+AA122","v":372},{"$f":"X122+Y122+Z122+AA122+AB122","v":378}]
["I20","Óbitos Pós-Neonatais","RA","R02","REGIÃO ALENTEJO","Região Alentejo","I20R02",10,5,8,7,13,4,6,10,2,5,4,7,9,9,4,1,1,5,2,7,2,23,20,28,24,23,20,18,17,11,16,20,25,22,14,6,null,null,null,null,43,27,33,{"$f":"W123+X123+Y123+Z123+AA123","v":16},{"$f":"X123+Y123+Z123+AA123+AB123","v":17}]
["I20","Óbitos Pós-Neonatais","A101","R03","ALENTEJO CENTRAL","ACeS Alentejo Central","I20R03",4,4,2,2,2,1,3,3,1,0,1,1,0,3,2,0,0,2,0,3,0,10,8,6,5,6,7,7,4,2,2,2,4,5,5,2,null,null,null,null,14,8,7,5,5]
["I20","Óbitos Pós-Neonatais","A102","R04","ALTO ALENTEJO","ULS Norte Alentejano","I20R04",0,1,2,3,1,0,1,1,0,2,1,2,2,1,0,1,1,1,0,0,0,3,6,6,4,2,2,2,3,3,5,5,5,3,2,2,null,null,null,null,7,4,6,3,2]
["I20","Óbitos Pós-Neonatais","A103","R05","BAIXO ALENTEJO","ULS Baixo Alentejo","I20R05",2,0,2,0,6,2,0,2,1,1,2,2,6,2,2,0,0,2,2,2,2,4,2,8,8,8,4,3,4,4,5,10,10,10,4,2,null,null,null,null,10,6,14,6,8]
["I20","Óbitos Pós-Neonatais","A104","R06","ALENTEJO LITORAL ","ULS Litoral Alentejano","I20R06",4,0,2,2,4,1,2,4,0,2,0,2,1,3,0,0,0,0,0,2,0,6,4,8,7,7,7,6,6,2,4,3,6,4,3,0,null,null,null,null,12,9,6,2,2]
["I21","Taxa de Mortalidade Pós-Neonatal","CT","R01","CONTINENTE","Continente","I21R01",2.5948219315507197,2.2483748671201047,2.1992008010705897,1.9564641025406606,2.0208616459873983,2.0097859671860179,1.5805235137533273,1.4214172753972438,1.2777202373462138,1.2666795590794817,1.1533099996991365,1.3515604849110137,1.1912333303047742,1.1661931215809338,0.82177816150541438,0.76335877862595414,1.1136379621597543,1.0050123400249344,0.740627234651139,0.86109334251832892,0.91560749352448645,2.3451506199025327,2.1330886068885122,2.0573134763135856,1.995880648159962,1.872014000469528,1.6702866598317871,1.4288726698202578,1.322848533842875,1.2335123775461587,1.2564237580734392,1.2309981568846278,1.2366261806507617,1.0603977700560248,0.91792867091725527,0.8933180541775434,0.95457177284321548,0.95779113547790473,0.86898115108517693,0.84085916021252305]
["I21","Taxa de Mortalidade Pós-Neonatal","RA","R02","REGIÃO ALENTEJO","Região Alentejo","I21R02",2.2763487366264514,1.0699764605178688,1.7193208682570384,1.4931740614334472,2.7208036835496023,0.90436355414876779,1.3207131851199647,2.1753317380900588,0.43649061545176776,1.1160714285714286,0.97513408093612863,1.7504376094023506,2.1489971346704873,2.2288261515601784,0.9650180940892642,0.24449877750611246,0.25400050800101598,1.4156285390713477,0.58875478363261702,1.9379844961240309,0.54659743099207425,1.6765070340403818,1.4271442842871414,1.9831432821021318,1.727986176110591,1.6734575087310826,1.4746000147460001,1.3117621337997378,1.2446006296214949,0.83561227590398057,1.2717590016691835,1.6274717226788185,2.0449897750511248,1.7783525988198206,1.1407153915098183,0.49293460400920147,0.60558871874729647,0.73624148720780414,1.3281472346077221,1.0311211098612674]
["I21","Taxa de Mortalidade Pós-Neonatal","A101","R03","ALENTEJO CENTRAL","ACeS Alentejo Central","I21R03",2.6917900403768504,2.4922118380062308,1.2944983818770226,1.2755102040816326,1.256281407035176,0.67476383265856943,1.9582245430809397,1.9096117122851686,0.6414368184733803,0,0.68399452804377558,0.73746312684365778,0,2.2953328232593728,1.5151515151515151,0,0,1.7361111111111109,0,2.5337837837837838,0,2.1570319240724762,1.6956337431114878,1.2752391073326248,1.0771219302024988,1.3026487190620928,1.5267175572519083,1.5015015015015014,0.87108013937282225,0.44612982377871963,0.46728971962616822,0.47281323877068554,0.98159509202453998,1.2379301807378065,1.2528188423953897,0.50339793606846217,0.52562417871222078,0.56449336720293541,1.4543339150668992,0.8537279453614115]
["I21","Taxa de Mortalidade Pós-Neonatal","A102","R04","ALTO ALENTEJO","ULS Norte Alentejano","I21R04",0,0.90252707581227443,1.86046511627907,2.5996533795493937,0.87183958151700092,0,0.95057034220532322,0.9852216748768472,0,2.0020020020020022,1.1750881316098707,2.4937655860349128,2.2321428571428572,1.1376564277588168,0,1.1402508551881414,1.2195121951219512,1.2610340479192939,0,0,0,0.92621179376350715,1.7980221756068324,1.777251184834123,1.199040767386091,0.6184291898577613,0.64474532559638942,0.65659881812212728,1.0023387905111927,1.0604453870625663,1.8853695324283559,1.9615535504119261,1.9402405898331394,1.1156563778356265,0.74906367041198507,0.76599004212945232,1.2048192771084338,0.85910652920962194,0.43725404459991257,0]
["I21","Taxa de Mortalidade Pós-Neonatal","A103","R05","BAIXO ALENTEJO","ULS Baixo Alentejo","I21R05",1.8050541516245489,0,1.5936254980079683,0,4.8543689320388346,1.784121320249777,0,1.6977928692699491,0.84602368866328259,0.8347245409015025,1.9212295869356388,1.8331805682859763,5.6338028169014089,1.8814675446848543,1.8399264029438822,0,0,2.1715526601520088,2.1344717182497335,2.109704641350211,1.9607843137254901,1.1289867344058708,0.56006720806496779,2.2056796250344637,2.2902948754652162,2.2720817949446181,1.155067860236789,0.85130533484676496,1.1242270938729624,1.1692487576731949,1.5015015015015014,3.1279324366593682,3.1065548306927617,3.1104199066874028,1.2634238787113075,0.63271116735210375,0.667779632721202,1.371742112482853,2.1382751247327159,2.0654044750430289]
["I21","Taxa de Mortalidade Pós-Neonatal","A104","R06","ALENTEJO LITORAL ","ULS Litoral Alentejano","I21R06",5.3835800807537009,0,2.5706940874035986,2.4096385542168677,4.9813200498132009,1.2738853503184713,2.5157232704402515,4.8019207683073226,0,2.4360535931790497,0,2.6666666666666665,1.2269938650306749,3.8022813688212929,0,0,0,0,0,2.8530670470756063,0,2.6075619295958279,1.6750418760469012,3.3181252592285357,2.8949545078577335,2.9374737725556024,2.9009531703273934,2.4096385542168677,2.3847376788553256,0.82270670505964627,1.7248814144027598,1.2970168612191959,2.5488530161427359,1.6474464579901154,1.2264922322158627,0,0,0,0.99502487562189046,0.98814229249011853]
["I26","Nados Vivos + Fetos Mortos 28+s","CT","R01","CONTINENTE","Continente","I26R01",104155,106733,107273,109778,113741,106833,108555,106548,103576,103703,100019,97192,99305,94594,96362,91909,85533,78780,78486,81498,83193,318161,323784,330792,330352,329129,321936,318679,313827,307298,300914,296516,291091,290261,282866,273804,null,null,null,null,541680,529215,487472,{"$f":"W134+X134+Y134+Z134+AA134","v":416206},{"$f":"X134+Y134+Z134+AA134+AB134","v":407490}]
["I26","Nados Vivos + Fetos Mortos 28+s","RA","R02","REGIÃO ALENTEJO","Região Alentejo","I26R02",4411,4696,4663,4718,4808,4445,4567,4615,4595,4501,4115,4020,4199,4053,4162,4098,3959,3543,3404,3624,3670,13770,14077,14189,13971,13820,13627,13777,13711,13211,12636,12334,12272,12414,12314,12220,null,null,null,null,23296,22723,20549,{"$f":"W135+X135+Y135+Z135+AA135","v":18628},{"$f":"X135+Y135+Z135+AA135+AB135","v":18200}]
["I26","Nados Vivos + Fetos Mortos 28+s","A101","R03","ALENTEJO CENTRAL","ACeS Alentejo Central","I26R03",1490,1610,1549,1580,1601,1491,1539,1575,1566,1469,1466,1362,1415,1312,1324,1369,1293,1158,1103,1189,1232,4649,4739,4730,4672,4631,4605,4680,4610,4501,4297,4243,4089,4051,4005,3986,null,null,null,null,7830,7640,6879,6112,5975]
["I26","Nados Vivos + Fetos Mortos 28+s","A102","R04","ALTO ALENTEJO","ULS Norte Alentejano","I26R04",1061,1118,1077,1164,1157,1039,1057,1019,980,1001,852,807,902,883,918,877,826,795,717,780,733,3256,3359,3398,3360,3253,3115,3056,3000,2833,2660,2561,2592,2703,2679,2622,null,null,null,null,5577,5096,4362,3995,3851]
["I26","Nados Vivos + Fetos Mortos 28+s","A103","R05","BAIXO ALENTEJO","ULS Baixo Alentejo","I26R05",1114,1186,1257,1139,1243,1127,1171,1186,1185,1204,1045,1098,1066,1065,1094,1017,1067,922,939,952,1023,3557,3582,3639,3509,3541,3484,3542,3575,3434,3347,3209,3229,3225,3176,3178,null,null,null,null,5939,5873,5368,4897,4903]
["I26","Nados Vivos + Fetos Mortos 28+s","A104","R06","ALENTEJO LITORAL ","ULS Litoral Alentejano","I26R06",746,782,780,835,807,788,800,835,864,827,752,753,816,793,826,835,773,668,645,703,682,2308,2397,2422,2430,2395,2423,2499,2526,2443,2332,2321,2362,2435,2454,2434,null,null,null,null,3950,4114,3940,3624,3471]
["I22","Fetos Mortos de 28 ou mais semanas","CT","R01","CONTINENTE","Continente","I22R01",487,434,416,397,423,354,363,316,267,283,306,267,248,270,229,209,227,174,174,206,188,1337,1247,1236,1174,1140,1033,946,866,856,856,821,785,747,708,664,null,null,null,null,2157,1583,1320,{"$f":"W140+X140+Y140+Z140+AA140+AB140","v":1178},{"$f":"X140+Y140+Z140+AA140+AB140","v":969}]
["I22","Fetos Mortos de 28 ou mais semanas","RA","R02","REGIÃO ALENTEJO","Região Alentejo","I22R02",18,23,10,30,30,22,24,18,13,21,13,21,11,15,17,8,22,11,7,12,11,51,63,70,82,76,64,55,52,47,55,45,47,43,40,47,null,null,null,null,111,98,77,{"$f":"W141+X141+Y141+Z141+AA141+AB141","v":71},{"$f":"X141+Y141+Z141+AA141+AB141","v":63}]
["I22","Fetos Mortos de 28 ou mais semanas","A101","R03","ALENTEJO CENTRAL","ACeS Alentejo Central","I22R03",4,5,4,12,9,9,7,4,7,7,4,6,3,5,4,5,4,6,1,5,4,13,21,25,30,25,20,18,18,18,17,13,14,12,14,13,null,null,null,null,34,34,22,25,20]
["I22","Fetos Mortos de 28 ou mais semanas","A102","R04","ALTO ALENTEJO","ULS Norte Alentejano","I22R04",5,10,2,10,10,4,5,4,1,2,1,5,6,4,4,0,6,2,2,1,2,17,22,22,24,19,13,10,7,4,8,12,15,14,8,10,null,null,null,null,37,16,20,13,13]
["I22","Fetos Mortos de 28 ou mais semanas","A103","R05","BAIXO ALENTEJO","ULS Baixo Alentejo","I22R05",6,6,2,3,7,6,7,8,3,6,4,7,1,2,7,1,9,1,2,4,3,14,11,12,16,20,21,18,17,13,17,12,10,10,10,17,null,null,null,null,24,30,21,20,19]
["I22","Fetos Mortos de 28 ou mais semanas","A104","R06","ALENTEJO LITORAL ","ULS Litoral Alentejano","I22R06",3,2,2,5,4,3,5,2,2,6,4,3,1,4,2,2,3,2,2,2,2,7,9,11,12,12,10,9,10,12,13,8,8,7,8,7,null,null,null,null,16,18,14,13,11]
["I23","Taxa de Mortalidade Fetal Tardia","CT","R01","CONTINENTE","Continente","I23R01",4.6757236810522773,4.0662213186174849,3.8779562424841294,3.6163894405072057,3.7189755672976323,3.3135828816938586,3.3439270415918196,2.965799451890228,2.5778172549625396,2.7289470892838201,3.0594187104450152,2.7471396822783771,2.4973566285685513,2.8543036556229779,2.376455449243478,2.2739884015711196,2.6539464300328528,2.2086824067022088,2.2169558902224602,2.5276693906598937,2.2598055124830214,4.2022749488466529,3.8513329874237145,3.7364869767104403,3.5537850535186712,3.4636874903153472,3.2087122906416181,2.9685043570489427,2.7594821350616741,2.7855697075802643,2.8446665824787152,2.7688219185473972,2.6967511877728958,2.5735458776756093,2.5029607763420714,2.4287446494572764,2.3807479451413229,2.3682140371253588,2.3202827897002898,2.3357472129354342]
["I23","Taxa de Mortalidade Fetal Tardia","RA","R02","REGIÃO ALENTEJO","Região Alentejo","I23R02",4.080707322602585,4.8977853492333905,2.1445421402530558,6.3586265366680799,6.2396006655574041,4.9493813273340832,5.2550908692796146,3.9003250270855903,2.8291621327529923,4.665629860031105,3.1591737545565004,5.2238805970149258,2.619671350321505,3.7009622501850479,4.0845747236905332,1.9521717911176184,5.5569588279868656,3.1047135196161446,2.0564042303172738,3.3112582781456954,2.9972752043596729,3.7037037037037037,4.4753853804077579,4.9333991119881597,5.8693006942953261,5.4992764109985526,4.6965583033683131,3.992160847789795,3.7925753045000365,3.5576413594731662,4.3526432415321299,3.6484514350575648,3.8298565840938723,3.4638311583695827,3.2485990416632826,3.8464686144529012,3.5344827586206895,3.6677058499908304,2.8379528899820263,2.8042624789680315]
["I23","Taxa de Mortalidade Fetal Tardia","A101","R03","ALENTEJO CENTRAL","ACeS Alentejo Central","I23R03",2.6845637583892614,3.1055900621118009,2.5823111684958038,7.5949367088607591,5.6214865708931914,6.0362173038229372,4.5484080571799872,2.5396825396825395,4.4699872286079181,4.7651463580667119,2.7285129604365621,4.4052863436123353,2.1201413427561837,3.8109756097560976,3.0211480362537766,3.652300949598247,3.0935808197989174,5.1813471502590671,0.90661831368993651,4.2052144659377628,3.2467532467532472,2.796300279630028,4.431314623338257,5.2854122621564485,6.4212328767123283,5.3984020729863955,4.3431053203040175,3.8461538461538463,3.9045553145336229,3.9991113085980894,3.9562485454968583,3.0638699033702568,3.4238200048911716,2.9622315477659837,3.4956304619225969,3.2614149523331659,3.9267015706806281,3.0951041080472708,3.4782608695652177,2.8376844494892168]
["I23","Taxa de Mortalidade Fetal Tardia","A102","R04","ALTO ALENTEJO","ULS Norte Alentejano","I23R04",4.7125353440150795,8.9445438282647576,1.8570102135561746,8.5910652920962214,8.6430423509075194,3.8498556304138596,4.7303689687795645,3.9254170755642783,1.0204081632653061,1.9980019980019981,1.1737089201877935,6.195786864931847,6.6518847006651889,4.5300113250283127,4.3572984749455346,0,7.2639225181598066,2.5157232704402515,2.7894002789400276,1.2820512820512822,2.7285129604365621,5.2211302211302213,6.5495683239059241,6.474396703943496,7.1428571428571423,5.8407623731939751,4.173354735152488,3.2722513089005236,2.3333333333333335,1.4119308153900458,3.0075187969924815,4.6856696602889496,5.7870370370370363,5.1794302626711062,2.987303958177745,3.8153376573826785,3.2025620496397114,4.2771599657827206,2.1815008726003491,2.2421524663677128]
["I23","Taxa de Mortalidade Fetal Tardia","A103","R05","BAIXO ALENTEJO","ULS Baixo Alentejo","I23R05",5.3859964093357275,5.0590219224283306,1.5910898965791569,2.6338893766461808,5.6315366049879323,5.3238686779059448,5.977796754910333,6.7453625632377738,2.5316455696202533,4.9833887043189362,3.8277511961722488,6.3752276867030968,0.93808630393996251,1.8779342723004695,6.3985374771480803,0.98328416912487715,8.4348641049671986,1.0845986984815619,2.1299254526091587,4.2016806722689077,2.9325513196480939,3.9359010402024182,3.0709101060859854,3.2976092333058533,4.5597036192647478,5.6481219994351886,6.0275545350172219,5.0818746470920377,4.755244755244755,3.7856726849155504,5.0791753809381532,3.7394827048924899,3.0969340353050478,3.1007751937984498,3.1486146095717884,5.3492762743864066,3.6593479707252161,4.0983606557377055,2.4884464984002843,3.0885380919698009]
["I23","Taxa de Mortalidade Fetal Tardia","A104","R06","ALENTEJO LITORAL ","ULS Litoral Alentejano","I23R06",4.0214477211796247,2.5575447570332481,2.5641025641025643,5.9880239520958085,4.9566294919454768,3.8071065989847717,6.25,2.3952095808383231,2.3148148148148149,7.255139056831923,5.3191489361702127,3.9840637450199203,1.2254901960784315,5.0441361916771754,2.4213075060532687,2.3952095808383231,3.8809831824062098,2.9940119760479043,3.1007751937984498,2.8449502133712663,2.9325513196480939,3.0329289428076258,3.7546933667083855,4.5417010734929812,4.9382716049382713,5.010438413361169,4.1271151465125877,3.601440576230492,3.9588281868566901,4.9119934506753991,5.5746140651801026,3.4467901766479967,3.3869602032176123,2.8747433264887063,3.2599837000814995,2.8759244042728023,3.0755711775043935,3.3557046979865772,2.9761904761904758,2.9556650246305423]
["I24","Óbitos Perinatais","CT","R01","CONTINENTE","Continente","I24R01",804,725,709,677,700,573,637,532,439,443,460,419,394,421,337,345,355,270,287,314,308,2238,2111,2086,1950,1910,1742,1608,1414,1342,1322,1273,1234,1152,1103,1036,null,null,null,null,3615,2624,2031,{"$f":"W152+X152+Y152+Z152+AA152","v":1571},{"$f":"X152+Y152+Z152+AA152+AB152","v":1534}]
["I24","Óbitos Perinatais","RA","R02","REGIÃO ALENTEJO","Região Alentejo","I24R02",26,31,19,38,39,31,34,30,28,30,21,28,19,27,21,14,34,15,11,18,13,76,88,96,108,104,95,92,88,79,79,68,74,67,62,69,null,null,null,null,153,153,116,{"$f":"W153+X153+Y153+Z153+AA153","v":92},{"$f":"X153+Y153+Z153+AA153+AB153","v":91}]
["I24","Óbitos Perinatais","A101","R03","ALENTEJO CENTRAL","ACeS Alentejo Central","I24R03",6,10,6,15,11,11,9,8,13,10,5,9,4,7,6,6,8,7,2,6,4,22,31,32,37,31,28,30,31,28,24,18,20,17,19,20,null,null,null,null,48,51,31,29,27]
["I24","Óbitos Perinatais","A102","R04","ALTO ALENTEJO","ULS Norte Alentejano","I24R04",6,10,5,12,13,6,7,6,3,5,3,8,9,6,4,1,8,2,4,3,2,21,27,30,31,26,19,16,14,11,16,20,23,19,11,13,null,null,null,null,46,27,30,18,19]
["I24","Óbitos Perinatais","A103","R05","BAIXO ALENTEJO","ULS Baixo Alentejo","I24R05",9,8,4,5,11,7,10,11,8,7,7,7,3,7,9,4,11,3,2,7,4,21,17,20,23,28,28,29,26,22,21,17,17,19,20,24,null,null,null,null,37,43,33,27,27]
["I24","Óbitos Perinatais","A104","R06","ALENTEJO LITORAL ","ULS Litoral Alentejano","I24R06",5,3,4,6,4,7,8,5,4,8,6,4,3,7,2,3,7,3,3,2,3,12,13,14,17,19,20,17,17,18,18,13,14,12,12,12,null,null,null,null,22,32,22,18,18]
["I25","Taxa de Mortalidade Perinatal","CT","R01","CONTINENTE","Continente","I25R01",7.7192645576304546,6.7926508202711444,6.6093052305799223,6.1669915647944036,6.1543330900906446,5.3635112746061608,5.867993183179034,4.9930547734354471,4.2384336139646246,4.2718147015997605,4.5991261660284541,4.3110544077701869,3.9675746437742307,4.450599403767681,3.4972291982316683,3.7537129116843837,4.1504448575403652,3.4272658035034271,3.6567031062864719,3.8528552847922648,3.7022345630040991,7.0341745217044203,6.5197786178439951,6.3060775351278151,5.9027945948563953,5.8031957074581699,5.4110133691168434,5.0458298162100421,4.5056671350776067,4.3670964340802731,4.3932818014449309,4.2931915984297637,4.2392241601423608,3.968841835451542,3.8993866331995828,3.7873807541160827,3.785779519323087,3.7561933945362216,3.6479536278500948,3.738017986898432]
["I25","Taxa de Mortalidade Perinatal","RA","R02","REGIÃO ALENTEJO","Região Alentejo","I25R02",5.8943550215370673,6.6013628620102214,4.0746300664808066,8.0542602797795677,8.1114808652246246,6.9741282339707542,7.4447120648127871,6.5005417118093174,6.093579978237214,6.6651855143301484,5.1032806804374244,6.9651741293532341,4.5248868778280551,6.6617320503330868,5.045651129264777,3.4163006344558324,8.5880272796160639,4.2337002540220148,3.2314923619271445,4.9668874172185431,3.542234332425068,5.5192447349310099,6.2513319599346451,6.7658044964409054,7.7302984754133561,7.5253256150506509,6.9714537315623391,6.67779632721202,6.4182043614616004,5.9798652637953227,6.2519784742006959,5.5132155018647646,6.0299869621903515,5.3971322700177211,5.0353285145780884,5.6469432850478762,5.431034482758621,5.501558774986246,4.1623309053069724,3.9259674705552441]
["I25","Taxa de Mortalidade Perinatal","A101","R03","ALENTEJO CENTRAL","ACeS Alentejo Central","I25R03",4.026845637583893,6.2111801242236018,3.8734667527437057,9.4936708860759502,6.8707058088694559,7.3775989268947013,5.8479532163742682,5.0793650793650791,8.3014048531289912,6.8073519400953026,3.4106412005457027,6.607929515418502,2.8268551236749113,5.3353658536585371,4.5317220543806647,4.3827611395178963,6.1871616395978348,6.0449050086355793,1.813236627379873,5.0462573591253159,3.2467532467532472,4.7322004732200469,6.5414644439755225,6.765327695560253,7.919520547945206,6.6940185705031316,6.0803474484256244,6.4102564102564097,6.7245119305856829,6.2208398133748055,5.5852920642308588,4.2422814046665094,4.8911714355588165,4.1964946926684767,4.7440699126092385,5.0175614651279474,5.4973821989528799,4.7833427124366903,4.3478260869565215,3.4052213393870598]
["I25","Taxa de Mortalidade Perinatal","A102","R04","ALTO ALENTEJO","ULS Norte Alentejano","I25R04",5.6550424128180961,8.9445438282647576,4.6425255338904359,10.309278350515465,11.235955056179774,5.7747834456207885,6.6225165562913908,5.8881256133464177,3.0612244897959182,4.9950049950049946,3.5211267605633805,9.9132589838909535,9.9778270509977816,6.7950169875424686,4.3572984749455346,1.1402508551881414,9.6852300242130749,2.5157232704402515,5.5788005578800552,3.8461538461538463,2.7285129604365621,6.4496314496314495,8.0381065793390878,8.8287227781047672,9.2261904761904763,7.9926221948970184,6.0995184590690208,5.2356020942408383,4.666666666666667,3.882809742322626,6.015037593984963,7.8094494338149154,8.8734567901234556,7.0292267850536438,4.1075429424943986,4.9599389545974812,4.4035228182546042,5.9880239520958085,3.9267015706806281,4.0358744394618835]
["I25","Taxa de Mortalidade Perinatal","A103","R05","BAIXO ALENTEJO","ULS Baixo Alentejo","I25R05",8.0789946140035909,6.7453625632377738,3.1821797931583138,4.3898156277436353,8.8495575221238933,6.2111801242236018,8.5397096498719041,9.2748735244519391,6.7510548523206753,5.8139534883720927,6.6985645933014357,6.3752276867030968,2.8142589118198873,6.572769953051643,8.2266910420475323,3.9331366764995086,10.309278350515465,3.2537960954446854,2.1299254526091587,7.3529411764705879,3.9100684261974585,5.9038515603036261,4.7459519821328859,5.4960153888430892,6.5545739526930751,7.9073707992092634,8.0367393800229614,8.1874647092038408,7.2727272727272725,6.4065230052417004,6.27427547057066,5.2976004985976939,5.2647878600185818,5.8914728682170541,6.2972292191435768,7.5519194461925743,5.9880239520958085,5.4644808743169397,4.2659082829719166,4.4612216884008236]
["I25","Taxa de Mortalidade Perinatal","A104","R06","ALENTEJO LITORAL ","ULS Litoral Alentejano","I25R06",6.7024128686327078,3.8363171355498724,5.1282051282051286,7.1856287425149699,4.9566294919454768,8.8832487309644677,10,5.9880239520958085,4.6296296296296298,9.6735187424425622,7.9787234042553186,5.3120849933598935,3.6764705882352939,8.827238335435057,2.4213075060532687,3.5928143712574849,9.0556274256144889,4.4910179640718564,4.6511627906976747,2.8449502133712663,4.3988269794721413,5.1993067590987874,5.423445974134335,5.7803468208092479,6.9958847736625511,7.9331941544885183,8.2542302930251754,6.8027210884353737,6.7300079176563736,7.367990176013099,7.7186963979416809,5.6010340370529947,5.9271803556308216,4.9281314168377826,4.8899755501222497,4.9301561216105174,5.7117750439367319,6.2320230105465013,3.9682539682539679,3.9408866995073888]
[]
[null,null,null,null,null,null,null,2,3,4,5,6,7,8,9,10,11,12,13,14,15,16,17,18,19,20,21,22,23,24,25,26,27,28,29,30,31,32,33,34,35,36,37,38,39,40,41,42,43,44,45,46]

{"sheet":"Id","index":3,"n_rows":136,"n_cols":15,"rows_kept":136,"cut":false,"hidden":true,"merged":[]}
["Lista de Variáveis"]
[]
[null,null,null,null,null,"Consulta de Dados por Indicador ou por Local de Residência",2,null,null,"Cod_IndRes","col_proc","Valor_ConsAnual"]
[null,null,null,null,null,null,null,null,null,{"$f":"CONCATENATE(J9,J40)","v":"I20R06"},22,{"$f":"VLOOKUP(Cod_IndRes,BaseAnual,col_proc,FALSE)","v":0}]
[]
[null,"n1","n2","n3","cod_Ind","Indicador","Ind_Abrev","Anual","ContarInd","Id_Indicador"]
[null,1,null,null,null,"----- Selecionar -----",null,null,{"$f":"COUNTIF(H8:H34,\"VERDADEIRO\")","v":0},20]
[null,2,0,"I01","NB01","Nados Vivos","Nados Vivos",false,null,{"$f":"INDEX(Indicadores,Id_Indicador)","v":"Óbitos Pós-Neonatais"}]
[null,3,1,"I02","NT01","Taxa Bruta de Natalidade","Taxa Bruta de Natalidade",false,null,{"$f":"INDEX(cod_I,Id_Indicador)","v":"I20"}]
[null,4,0,"I03","NB02","Nascimentos em Mulheres com Idade Inferior a 20 anos","Nasc. Mulheres < 20 anos",false,null,{"$f":"INDEX(NumForm,Id_Indicador)","v":0}]
[null,5,1,"I04","NT02","Proporção de Nascimentos em Mulheres com Idade Inferior a 20 anos","Proporção Nasc. Mulheres < 20 anos",false,null,{"$f":"INDEX(Indicadores_Abrev,Id_Indicador)","v":"Óbitos Pós-Neonatais"}]
[null,6,0,"I05","NB03","Nascimentos em Mulheres com Idade igual ou superior a 35 anos","Nasc. Mulheres ≥35 anos",false]
[null,7,1,"I06","NT03","Proporção de Nascimentos em Mulheres com Idade igual ou superior a 35 anos","Proporção Nasc. Mulheres ≥35 anos",false]
[null,8,0,"I07","NB04","Nascimentos Pré-termo","Nascimentos Pré-termo",false]
[null,9,1,"I08","NT04","Proporção de Nascimentos Pré-termo","Proporção de Nascimentos Pré-termo",false]
[null,10,0,"I09","NB05","Crianças com Baixo Peso à Nascença","Baixo Peso à Nascença",false]
[null,11,1,"I10","NT05","Proporção de Crianças com Baixo Peso à Nascença","Proporção de Baixo Peso à Nascença",false]
[null,12,2,"I11","NT06","Índice Sintético de Fecundidade (ISF)","Índice Sintético de Fecundidade (ISF)",false]
[null,13,0,"I12","MB01","Óbitos","Óbitos",false]
[null,14,1,"I13","MT01","Taxa Bruta de Mortalidade","Taxa Bruta de Mortalidade",false]
[null,15,0,"I14","MB02","Óbitos Infantis","Óbitos Infantis",false]
[null,16,1,"I15","MT02","Taxa de Mortalidade Infantil","Taxa de Mortalidade Infantil",false]
[null,17,0,"I16","MB03","Óbitos Neonatais","Óbitos Neonatais",false]
[null,18,1,"I17","MT03","Taxa de Mortalidade Neonatal","Taxa de Mortalidade Neonatal",false]
[null,19,0,"I18","MB04","Óbitos Neonatais Precoces","Óbitos Neonatais Precoces",false]
[null,20,1,"I19","MT04","Taxa de Mortalidade Neonatal Precoce","Taxa de Mortalidade Neonatal Precoce",false]
[null,21,0,"I20","MB05","Óbitos Pós-Neonatais","Óbitos Pós-Neonatais",false]
[null,22,1,"I21","MT05","Taxa de Mortalidade Pós-Neonatal","Taxa de Mortalidade Pós-Neonatal",false]
[null,23,0,"I22","MB06","Fetos Mortos de 28 ou mais semanas","Fetos Mortos de 28 ou mais semanas",false]
[null,24,1,"I23","MT06","Taxa de Mortalidade Fetal Tardia","Taxa de Mortalidade Fetal Tardia",false]
[null,25,0,"I24","MB07","Óbitos Perinatais","Óbitos Perinatais",false]
[null,26,1,"I25","MT07","Taxa de Mortalidade Perinatal","Taxa de Mortalidade Perinatal",false]
[null,27,0,"I26","NM01","Nados Vivos + Fetos Mortos 28+s","Nados Vivos + Fetos Mortos 28+s"]
[null,28,1,"I27","PB01","População Média","População Média"]
[null,null,null,null,null,"Todos",null,false]
[]
[null,"n1","n2","n3","cod_LR","Local_Residencia","Res_Abrev","Anual","ContarRes","Id_Residencia"]
[null,null,null,null,null,"----- Selecionar -----",null,null,{"$f":"COUNTIF(H39:H44,\"VERDADEIRO\")","v":0},6]
[null,null,null,"R01","CT","Continente","CT",false,null,{"$f":"INDEX(Residencia,Id_Residencia)","v":"ULS Litoral Alentejano"}]
[null,null,null,"R02","RA","Região Alentejo","RA",false,null,{"$f":"INDEX(cod_R,Id_Residencia)","v":"R06"}]
[null,null,null,"R03","A401","ACeS Alentejo Central","A401",false]
[null,null,null,"R04","A402","ULS Norte Alentejano","A402",false]
[null,null,null,"R05","A403","ULS Baixo Alentejo","A403",false]
[null,null,null,"R06","A404","ULS Litoral Alentejano","A404",false]
[null,null,null,null,null,"Todos",null,false]
[]
[null,"n1","n2","n3","cod_Ano","Ano","Ano_Abrev",null,"ContarAno","Id_Ano",null,"Identificar Colunas (ANO)",null,"Colunas a Formatar"]
[null,1,null,null,null,"----- Selecionar -----",null,null,{"$f":"COUNTIF(H49:H69,\"VERDADEIRO\")","v":0},21,null,21,{"$f":"INDEX(ncol,Id_col)","v":"W"},{"$f":"ContarAno+1","v":1},{"$f":"INDEX(ncol,N48)","v":"C"}]
[null,2,1,"A01","A96",1996,96,false,null,{"$f":"INDEX(Ano,Id_Ano)","v":2016},null,"C"]
[null,3,2,"A02","A97",1997,97,false,null,{"$f":"INDEX(cod_A,Id_Ano)","v":"A21"},null,"D"]
[null,4,3,"A03","A98",1998,98,false,null,null,null,"E"]
[null,5,4,"A04","A99",1999,99,false,null,null,null,"F"]
[null,6,5,"A05","A00",2000,"00",false,null,null,null,"G"]
[null,7,6,"A06","A01",2001,"01",false,null,null,null,"H"]
[null,8,7,"A07","A02",2002,"02",false,null,null,null,"I"]
[null,9,8,"A08","A03",2003,"03",false,null,null,null,"J"]
[null,10,9,"A09","A04",2004,"04",false,null,null,null,"K"]
[null,11,10,"A10","A05",2005,"05",false,null,null,null,"L"]
[null,12,11,"A11","A06",2006,"06",false,null,null,null,"M"]
[null,13,12,"A12","A07",2007,"07",false,null,null,null,"N"]
[null,14,13,"A13","A08",2008,"08",false,null,null,null,"O"]
[null,15,14,"A14","A09",2009,"09",false,null,null,null,"P"]
[null,16,15,"A15","A10",2010,"10",false,null,null,null,"Q"]
[null,17,16,"A16","A11",2011,"11",false,null,null,null,"R"]
[null,18,17,"A17","A12",2012,"12",false,null,null,null,"S"]
[null,19,18,"A18","A13","2013","13",false,null,null,null,"T"]
[null,20,19,"A19","A14",2014,"14",false,null,null,null,"U"]
[null,21,20,"A20","A15",2015,"15",false,null,null,null,"V"]
[null,22,21,"A21","A16",2016,16,false,null,null,null,"W"]
[null,null,null,null,null,"Todos",null,false,null,null,null,"X"]
[]
[null,"n1","n2","n3","cod_Tri","Triénio","Tri_Abrev"]
[null,null,1,null,null,"----- Selecionar -----"]
[null,null,2,1,"T01","1996-1998","96-98"]
[null,null,3,2,"T02","1997-1999","97-99"]
[null,null,4,3,"T03","1998-2000","98-00"]
[null,null,5,4,"T04","1999-2001","99-01"]
[null,null,6,5,"T05","2000-2002","00-02"]
[null,null,7,6,"T06","2001-2003","01-03"]
[null,null,8,7,"T07","2002-2004","02-04"]
[null,null,9,8,"T08","2003-2005","03-05"]
[null,null,10,9,"T09","2004-2006","04-06"]
[null,null,11,10,"T10","2005-2007","05-07"]
[null,null,12,11,"T11","2006-2008","06-08"]
[null,null,13,12,"T12","2007-2009","07-09"]
[null,null,14,13,"T13","2008-2010","08-10"]
[null,null,15,14,"T14","2009-2011","09-11"]
[null,null,16,15,"T15","2010-2012","10-12"]
[null,null,17,16,"T16","2011-2013","11-13"]
[null,null,18,17,"T17","2012-2014","12-14"]
[null,null,19,18,"T18","2013-2015","13-15"]
[null,null,20,19,"T19","2014-2016","14-16"]
[]
[null,"n1","n2","n3","cod_Qui","Quinquénio","Qui_Abrev"]
[null,null,null,null,null,"----- Selecionar -----"]
[null,null,null,1,"Q01","1996-2000","96-00"]
[null,null,null,2,"Q02","2001-2005","01-05"]
[null,null,null,3,"Q03","2006-2010","06-10"]
[null,null,null,4,"Q04","2011-2015","11-15"]
[null,null,null,5,"Q05","2012-2016","12-16"]
[]
[null,"n1","n2","n3","cod_LR","ACeS_Select"]
[null,null,null,1,null,"----- Selecionar -----"]
[null,null,null,2,"R03","ACeS Alentejo Central"]
[null,null,null,3,"R04","ULS Norte Alentejano"]
[null,null,null,4,"R05","ULS Baixo Alentejo"]
[null,null,null,5,"R06","ULS Litoral Alentejano"]
[]
[null,"n1","n2","n3","cod_Ind","Indicador_Select"]
[null,null,1,null,null,"----- Selecionar -----"]
[null,null,2,"A","I02","Taxa Bruta de Natalidade (Anual)","TAXA BRUTA DE NATALIDADE","(/1000 HABITANTES)","(ANUAL)"]
[null,null,3,"T","I04","Proporção de Nascimentos em Mulheres com Idade Inferior a 20 anos","PROPORÇÃO DE NASCIMENTOS EM MULHERES COM IDADE INFERIOR A 20 ANOS","(%)","(MÉDIA ANUAL POR TRIÉNIOS)"]
[null,null,4,"T","I06","Proporção de Nascimentos em Mulheres com Idade igual ou superior a 35 anos","PROPORÇÃO DE NASCIMENTOS EM MULHERES COM IDADE IGUAL OU SUPERIOR A 35 ANOS","(%)","(MÉDIA ANUAL POR TRIÉNIOS)"]
[null,null,5,"T","I08","Proporção de Nascimentos Pré-termo","PROPORÇÃO DE NASCIMENTOS PRÉ-TERMO","(%)","(MÉDIA ANUAL POR TRIÉNIOS)"]
[null,null,6,"T","I10","Proporção de Crianças com Baixo Peso à Nascença","PROPORÇÃO DE CRIANÇAS COM BAIXO PESO À NASCENÇA","(%)","(MÉDIA ANUAL POR TRIÉNIOS)"]
[null,null,7,"A","I11","Índice Sintético de Fecundidade, ISF (Anual)","ÍNDICE SINTÉTICO DE FECUNDIDADE","(ISF)","(ANUAL)"]
[null,null,8,"A","I13","Taxa Bruta de Mortalidade (Anual)","TAXA BRUTA DE MORTALIDADE","(/1000 HABITANTES)","(ANUAL)"]
[null,null,9,"T","I15","Taxa de Mortalidade Infantil","TAXA DE MORTALIDADE INFANTIL","(/1000 NADOS VIVOS)","(MÉDIA ANUAL POR TRIÉNIOS)"]
[null,null,10,"T","I17","Taxa de Mortalidade Neonatal","TAXA DE MORTALIDADE NEONATAL","(/1000 NADOS VIVOS)","(MÉDIA ANUAL POR TRIÉNIOS)"]
[null,null,11,"T","I19","Taxa de Mortalidade Neonatal Precoce","TAXA DE MORTALIDADE NEONATAL PRECOCE","(/1000 NADOS VIVOS)","(MÉDIA ANUAL POR TRIÉNIOS)"]
[null,null,12,"T","I21","Taxa de Mortalidade Pós-Neonatal","TAXA DE MORTALIDADE PÓS-NEONATAL","(/1000 NADOS VIVOS)","(MÉDIA ANUAL POR TRIÉNIOS)"]
[null,null,13,"T","I23","Taxa de Mortalidade Fetal Tardia","TAXA DE MORTALIDADE FETAL TARDIA","(/1000 (NADOS VIVOS + FETOS MORTOS DE 28 OU MAIS SEMANAS))","(MÉDIA ANUAL POR TRIÉNIOS)"]
[null,null,14,"T","I25","Taxa de Mortalidade Perinatal","TAXA DE MORTALIDADE PERINATAL","(/1000 (NADOS VIVOS + FETOS MORTOS DE 28 OU MAIS SEMANAS))","(MÉDIA ANUAL POR TRIÉNIOS)"]
[]
[null,"n1","n2","n3","cod_Ind","RazaoR_Indicador"]
[null,null,null,1,null,"----- Selecionar -----"]
[null,null,null,2,"I03","Nascimentos em Mulheres com Idade Inferior a 20 anos","NASCIMENTOS EM MULHERES COM IDADE INFERIOR A 20 ANOS"]
[null,null,null,3,"I05","Nascimentos em Mulheres com Idade igual ou superior a 35 anos","NASCIMENTOS EM MULHERES COM IDADE IGUAL OU SUPERIOR A 35 ANOS"]
[null,null,null,4,"I07","Nascimentos Pré-termo","NASCIMENTOS PRÉ-TERMO"]
[null,null,null,5,"I09","Crianças com Baixo Peso à Nascença","CRIANÇAS COM BAIXO PESO À NASCENÇA"]
[null,null,null,6,"I14","Óbitos Infantis","ÓBITOS INFANTIS"]
[null,null,null,7,"I16","Óbitos Neonatais","ÓBITOS NEONATAIS"]
[null,null,null,8,"I18","Óbitos Neonatais Precoces","ÓBITOS NEONATAIS PRECOCES"]
[null,null,null,9,"I20","Óbitos Pós-Neonatais","ÓBITOS PÓS-NEONATAIS"]
[null,null,null,10,"I22","Fetos Mortos de 28 ou mais semanas","FETOS MORTOS DE 28 OU MAIS SEMANAS"]
[null,null,null,11,"I24","Óbitos Perinatais","ÓBITOS PERINATAIS"]

{"sheet":"ConsAnual","index":4,"n_rows":7,"n_cols":2,"rows_kept":7,"cut":false,"hidden":false,"merged":[[1,1,1,5],[3,1,3,5],[6,1,6,5],[17,1,17,5]]}
[]
[null,"mort@lidades.infantil"]
[]
[null,"Consulta de Indicadores (Anual)"]
[]
[]
[null,"Selecione Indicador, Local de Residência e Ano. Gere os dados por Indicador ou por Local de Residência."]

{"sheet":"DadosAnual","index":5,"n_rows":4,"n_cols":2,"rows_kept":4,"cut":false,"hidden":false,"merged":[[0,1,0,21],[3,1,3,21],[1,1,1,22]]}
[]
[null,"mort@lidades.infantil"]
[]
[null,"Consulta de Indicadores (Anual)"]

{"sheet":"DefInd","index":6,"n_rows":39,"n_cols":3,"rows_kept":39,"cut":false,"hidden":false,"merged":[[0,1,0,2],[1,1,1,2],[3,1,3,2],[19,1,20,1],[40,1,40,2]]}
[]
[null,"mort@lidades.infantil"]
[]
[null,"Indicadores"]
[]
[]
[null,"INDICADORES DE NATALIDADE"]
[]
[null,"INDICADOR","DEFINIÇÃO"]
[null,"Nados vivos","Número de crianças nascidas vivas."]
[null,"Taxa bruta de natalidade","Número de nados vivos ocorrido durante um determinado período de tempo, normalmente um ano civil, referido à população média desse período (expressa em número de nados vivos por 1000 habitantes)."]
[null,"Nascimentos em mulheres com idade inferior a 20 anos","Número de nados vivos em mulheres com idade inferior a 20 anos."]
[null,"Proporção (%) de nascimentos em mulheres com idade inferior a 20 anos","Número de nados vivos em mulheres com idade inferior a 20 anos, durante um determinado período de tempo, referido ao número total de nados vivos."]
[null,"Nascimentos em mulheres com idade igual ou superior a 35 anos","Número de nados vivos em mulheres com idade igual ou superior a 35 anos."]
[null,"Proporção (%) de nascimentos em mulheres com idade igual ou superior a 35 anos","Número de nados vivos em mulheres com idade igual ou superior a 35 anos, durante um determinado período de tempo, referido ao número total de nados vivos do mesmo período."]
[null,"Nascimentos pré-termo","Número de nados vivos com menos de 37 semanas de gestação."]
[null,"Proporção (%) de nascimentos pré-termo","Número de nados vivos com menos de 37 semanas de gestação, durante um determinado período de tempo, referido ao número total de nados vivos do mesmo período."]
[null,"Crianças com baixo peso à nascença","Número de nascimentos de crianças com peso inferior a 2500 gramas."]
[null,"Proporção (%) de crianças com baixo peso à nascença","Número de nascimentos de crianças com peso inferior a 2500 gramas, durante um determinado período de tempo, referido ao número total de nados vivos do mesmo período."]
[null,"Índice sintético de fecundidade (ISF)","Número médio de crianças vivas nascidas por mulher em idade fértil (dos 15 aos 49 anos de idade), admitindo que as mulheres estariam submetidas às taxas de fecundidade observadas no momento. Valor resultante da soma das taxas de fecundidade por idades, ano a ano ou grupos quinquenais, entre os 15 e os 49 anos, observadas num determinado período (habitualmente um ano civil)."]
[null,null,"Nota: O número de 2,1 crianças por mulher é considerado o nível mínimo para assegurar a substituição de gerações, nos países mais desenvolvidos."]
[]
[null,"INDICADORES DE MORTALIDADE"]
[]
[null,"INDICADOR","DEFINIÇÃO"]
[null,"Óbitos","Número de óbitos."]
[null,"Taxa bruta de mortalidade","Número de óbitos observado durante um determinado período de tempo, normalmente um ano civil, referido à população média desse período (expressa em número de óbitos por 1000 habitantes)."]
[null,"Óbitos infantis","Número de óbitos de crianças com menos de 1 ano de idade."]
[null,"Taxa de mortalidade infantil","Número de óbitos de crianças com menos de 1 ano de idade observado durante um determinado período de tempo, referido ao número de nados vivos do mesmo período (habitualmente expressa em número de óbitos de crianças com menos de 1 ano por 1000 nados vivos)."]
[null,"Óbitos neonatais","Número de óbitos de crianças com menos de 28 dias de idade."]
[null,"Taxa de mortalidade neonatal","Número de óbitos de crianças com menos de 28 dias de idade observado durante um determinado período de tempo, referido ao número de nados vivos do mesmo período (expressa em número de óbitos de crianças com menos de 28 dias de idade por 1000 nados vivos)."]
[null,"Óbitos neonatais precoces","Número de óbitos de crianças com menos de 7 dias de idade."]
[null,"Taxa de mortalidade neonatal precoce","Número de óbitos de crianças com menos de 7 dias de idade observado durante um determinado período de tempo, referido ao número de nados vivos do mesmo período (expressa em número de óbitos de crianças com menos de 7 dias de idade por 1000 nados vivos)."]
[null,"Óbitos pós-neonatais","Número de óbitos de crianças com 28 ou mais dias de idade e menos de um ano de idade."]
[null,"Taxa de mortalidade pós-neonatal","Número de óbitos de crianças com 28 ou mais dias de idade e menos de um ano de idade observado durante um determinado período de tempo, referido ao número de nados vivos do mesmo período (expressa em número de óbitos de crianças com mais de 27 dias e menos de um ano de idade por 1000 nados vivos)."]
[null,"Fetos mortos de 28 ou mais semanas","Número de fetos mortos de 28 ou mais semanas."]
[null,"Taxa de mortalidade fetal tardia","Número de fetos mortos de 28 ou mais semanas observado durante um determinado período de tempo, referido ao número de nados vivos e fetos mortos de 28 ou mais semanas do mesmo período (expressa em número de fetos mortos de 28 ou mais semanas por 1000 nados vivos e fetos mortos de 28 ou mais semanas)."]
[null,"Óbitos perinatais","Número de óbitos fetais de 28 ou mais semanas de gestação e óbitos de nados vivos com menos de 7 dias de idade."]
[null,"Taxa de mortalidade perinatal","Número de óbitos fetais de 28 ou mais semanas de gestação e óbitos de nados vivos com menos de 7 dias de idade observado durante um determinado período de tempo, referido ao número de nados vivos e fetos mortos de 28 ou mais semanas do mesmo período (habitualmente expressa em número de óbitos fetais de 28 ou mais semanas e óbitos de nados vivos com menos de 7 dias de idade por 1000 nados vivos e fetos mortos de 28 ou mais semanas)"]

{"sheet":"AnACeS","index":7,"n_rows":153,"n_cols":22,"rows_kept":153,"cut":false,"hidden":false,"merged":[[105,2,105,21],[110,2,110,21],[99,2,99,18],[94,2,94,18],[34,2,34,18],[39,2,39,18],[90,2,90,21],[95,2,95,21],[100,2,100,21],[3,1,3,20],[5,1,5,2],[9,2,9,6],[7,2,7,20],[86,2,86,20],[9,10,9,20],[51,10,51,20],[51,2,51,8],[67,2,67,8],[26,2,26,20],[30,2,30,21],[35,2,35,21],[40,2,40,21],[44,2,44,21],[49,2,49,21],[29,2,29,18],[1,1,1,21],[170,1,170,20],[119,2,119,18],[104,2,104,18],[109,2,109,18],[114,2,114,18],[152,10,152,19],[122,10,122,20],[122,2,122,8],[137,10,137,20],[137,2,137,8],[152,2,152,8],[115,2,115,21],[120,2,120,21],[89,2,89,18],[67,10,67,19]]}
[]
[null,"mort@lidades.infantil"]
[]
[null,"Análise por ACeS"]
[]
[null,"Selecione o ACeS:"]
[]
[null,null,{"$f":"AnACeS_base!D1","v":""}]
[]
[null,null,"TAXA BRUTA DE NATALIDADE (/1000 HABITANTES), 1996-2016 (ANUAL)",null,null,null,null,null,null,null,"TAXA BRUTA DE MORTALIDADE (/1000 HABITANTES), 1996-2016 (ANUAL)"]
[]
[]
[]
[]
[]
[]
[]
[]
[]
[]
[]
[]
[]
[]
[]
[]
[null,null,"NATALIDADE"]
[]
[null,null,"Local de residência","96-98","97-99","98-00","99-01","00-02","01-03","02-04","03-05","04-06","05-07","06-08","07-09","08-10","09-11","10-12","11-13","12-14","13-15","14-16"]
[]
[null,null,"PROPORÇÃO (%) DE NASCIMENTOS EM MULHERES COM IDADE INFERIOR A 20 ANOS"]
[null,null,"Continente",{"$f":"AnACeS_base!F15","v":6.6005100623690121},{"$f":"AnACeS_base!G15","v":6.3397377665198098},{"$f":"AnACeS_base!H15","v":6.1570719392151858},{"$f":"AnACeS_base!I15","v":5.9997934248339799},{"$f":"AnACeS_base!J15","v":5.8386104412038211},{"$f":"AnACeS_base!K15","v":5.5742701065430982},{"$f":"AnACeS_base!L15","v":5.3239669785637629},{"$f":"AnACeS_base!M15","v":5.0479133182728839},{"$f":"AnACeS_base!N15","v":4.7920976889590854},{"$f":"AnACeS_base!O15","v":4.5957781495577521},{"$f":"AnACeS_base!P15","v":4.3757926241566478},{"$f":"AnACeS_base!Q15","v":4.2810000482249766},{"$f":"AnACeS_base!R15","v":4.0706148925440573},{"$f":"AnACeS_base!S15","v":3.8928681549633715},{"$f":"AnACeS_base!T15","v":3.700679873617462},{"$f":"AnACeS_base!U15","v":3.5088337010781969},{"$f":"AnACeS_base!V15","v":3.2697007728383647},{"$f":"AnACeS_base!W15","v":2.9314470425255026},{"$f":"AnACeS_base!X15","v":2.6462332394923518}]
[null,null,"Região Alentejo",{"$f":"AnACeS_base!F16","v":10.343319483927401},{"$f":"AnACeS_base!G16","v":9.6403596403596392},{"$f":"AnACeS_base!H16","v":9.0233019335646993},{"$f":"AnACeS_base!I16","v":8.841529267765857},{"$f":"AnACeS_base!J16","v":8.6364959254947617},{"$f":"AnACeS_base!K16","v":8.3314900833149004},{"$f":"AnACeS_base!L16","v":7.8632852353884273},{"$f":"AnACeS_base!M16","v":7.2260048319789147},{"$f":"AnACeS_base!N16","v":6.7000911577028255},{"$f":"AnACeS_base!O16","v":6.4223829584293775},{"$f":"AnACeS_base!P16","v":5.9809585808446579},{"$f":"AnACeS_base!Q16","v":5.6441717791411046},{"$f":"AnACeS_base!R16","v":5.343141217363188},{"$f":"AnACeS_base!S16","v":5.3613623400961457},{"$f":"AnACeS_base!T16","v":5.3072625698324023},{"$f":"AnACeS_base!U16","v":5.1388528419413442},{"$f":"AnACeS_base!V16","v":5.0708632431437515},{"$f":"AnACeS_base!W16","v":4.7908168105492841},{"$f":"AnACeS_base!X16","v":4.5088113985751779}]
[null,null,{"$f":"AnACeS_base!D1","v":""},{"$f":"AnACeS_base!F17","v":""},{"$f":"AnACeS_base!G17","v":""},{"$f":"AnACeS_base!H17","v":""},{"$f":"AnACeS_base!I17","v":""},{"$f":"AnACeS_base!J17","v":""},{"$f":"AnACeS_base!K17","v":""},{"$f":"AnACeS_base!L17","v":""},{"$f":"AnACeS_base!M17","v":""},{"$f":"AnACeS_base!N17","v":""},{"$f":"AnACeS_base!O17","v":""},{"$f":"AnACeS_base!P17","v":""},{"$f":"AnACeS_base!Q17","v":""},{"$f":"AnACeS_base!R17","v":""},{"$f":"AnACeS_base!S17","v":""},{"$f":"AnACeS_base!T17","v":""},{"$f":"AnACeS_base!U17","v":""},{"$f":"AnACeS_base!V17","v":""},{"$f":"AnACeS_base!W17","v":""},{"$f":"AnACeS_base!X17","v":""}]
[]
[null,null,"PROPORÇÃO (%) DE NASCIMENTOS EM MULHERES COM IDADE IGUAL OU SUPERIOR A 35 ANOS"]
[null,null,"Continente",{"$f":"AnACeS_base!F18","v":11.02852056662374},{"$f":"AnACeS_base!G18","v":11.798646356852082},{"$f":"AnACeS_base!H18","v":12.542026241367173},{"$f":"AnACeS_base!I18","v":13.286124832157679},{"$f":"AnACeS_base!J18","v":13.845586284905897},{"$f":"AnACeS_base!K18","v":14.458886330137144},{"$f":"AnACeS_base!L18","v":15.038412755363781},{"$f":"AnACeS_base!M18","v":15.711222804119362},{"$f":"AnACeS_base!N18","v":16.519276078344351},{"$f":"AnACeS_base!O18","v":17.424297969059317},{"$f":"AnACeS_base!P18","v":18.401393327584167},{"$f":"AnACeS_base!Q18","v":19.432598706192774},{"$f":"AnACeS_base!R18","v":20.605566570183136},{"$f":"AnACeS_base!S18","v":22.210329710055042},{"$f":"AnACeS_base!T18","v":23.649863256437197},{"$f":"AnACeS_base!U18","v":25.160399355272833},{"$f":"AnACeS_base!V18","v":26.669529030979589},{"$f":"AnACeS_base!W18","v":28.317870786281013},{"$f":"AnACeS_base!X18","v":30.032274153061099}]
[null,null,"Região Alentejo",{"$f":"AnACeS_base!F19","v":9.8039215686274517},{"$f":"AnACeS_base!G19","v":10.468103325246183},{"$f":"AnACeS_base!H19","v":11.43848714498194},{"$f":"AnACeS_base!I19","v":12.369501043991649},{"$f":"AnACeS_base!J19","v":12.645518044237486},{"$f":"AnACeS_base!K19","v":13.013345130133452},{"$f":"AnACeS_base!L19","v":13.489287275907301},{"$f":"AnACeS_base!M19","v":14.276301339775971},{"$f":"AnACeS_base!N19","v":14.896687936797326},{"$f":"AnACeS_base!O19","v":15.332644463874095},{"$f":"AnACeS_base!P19","v":16.429327040442672},{"$f":"AnACeS_base!Q19","v":17.267893660531698},{"$f":"AnACeS_base!R19","v":18.462533344111229},{"$f":"AnACeS_base!S19","v":19.620304733968872},{"$f":"AnACeS_base!T19","v":21.031876437725927},{"$f":"AnACeS_base!U19","v":22.372177524007267},{"$f":"AnACeS_base!V19","v":23.246824958586416},{"$f":"AnACeS_base!W19","v":24.504316478512475},{"$f":"AnACeS_base!X19","v":26.321709786276713}]
[null,null,{"$f":"AnACeS_base!D1","v":""},{"$f":"AnACeS_base!F20","v":""},{"$f":"AnACeS_base!G20","v":""},{"$f":"AnACeS_base!H20","v":""},{"$f":"AnACeS_base!I20","v":""},{"$f":"AnACeS_base!J20","v":""},{"$f":"AnACeS_base!K20","v":""},{"$f":"AnACeS_base!L20","v":""},{"$f":"AnACeS_base!M20","v":""},{"$f":"AnACeS_base!N20","v":""},{"$f":"AnACeS_base!O20","v":""},{"$f":"AnACeS_base!P20","v":""},{"$f":"AnACeS_base!Q20","v":""},{"$f":"AnACeS_base!R20","v":""},{"$f":"AnACeS_base!S20","v":""},{"$f":"AnACeS_base!T20","v":""},{"$f":"AnACeS_base!U20","v":""},{"$f":"AnACeS_base!V20","v":""},{"$f":"AnACeS_base!W20","v":""},{"$f":"AnACeS_base!X20","v":""}]
[]
[null,null,"PROPORÇÃO (%) DE NASCIMENTOS PRÉ-TERMO"]
[null,null,"Continente",null,null,null,null,{"$f":"AnACeS_base!J21","v":6.027031394345542},{"$f":"AnACeS_base!K21","v":6.3536333409161028},{"$f":"AnACeS_base!L21","v":6.7345853279325727},{"$f":"AnACeS_base!M21","v":6.7775217998408746},{"$f":"AnACeS_base!N21","v":7.1021596256387838},{"$f":"AnACeS_base!O21","v":7.8368182151450725},{"$f":"AnACeS_base!P21","v":8.6653477400700041},{"$f":"AnACeS_base!Q21","v":8.9602006159018419},{"$f":"AnACeS_base!R21","v":8.5187590237432396},{"$f":"AnACeS_base!S21","v":8.0207118731769906},{"$f":"AnACeS_base!T21","v":7.6957153683655575},{"$f":"AnACeS_base!U21","v":7.7433766802810515},{"$f":"AnACeS_base!V21","v":7.8514102648787905},{"$f":"AnACeS_base!W21","v":7.9173838209982792},{"$f":"AnACeS_base!X21","v":7.8974811321921283}]
[null,null,"Região Alentejo",null,null,null,null,{"$f":"AnACeS_base!J22","v":6.257275902211874},{"$f":"AnACeS_base!K22","v":6.4366290643662909},{"$f":"AnACeS_base!L22","v":6.7118495846086574},{"$f":"AnACeS_base!M22","v":6.8526246430924669},{"$f":"AnACeS_base!N22","v":7.0723184442418718},{"$f":"AnACeS_base!O22","v":8.1154121294014772},{"$f":"AnACeS_base!P22","v":8.5686386199039788},{"$f":"AnACeS_base!Q22","v":8.8016359918200404},{"$f":"AnACeS_base!R22","v":8.1157545873413639},{"$f":"AnACeS_base!S22","v":7.463537847307097},{"$f":"AnACeS_base!T22","v":7.0900427209990138},{"$f":"AnACeS_base!U22","v":6.9469677307725588},{"$f":"AnACeS_base!V22","v":7.0863243143751156},{"$f":"AnACeS_base!W22","v":7.2953230243809886},{"$f":"AnACeS_base!X22","v":7.2928383952006}]
[null,null,{"$f":"AnACeS_base!D1","v":""},null,null,null,null,{"$f":"AnACeS_base!J23","v":""},{"$f":"AnACeS_base!K23","v":""},{"$f":"AnACeS_base!L23","v":""},{"$f":"AnACeS_base!M23","v":""},{"$f":"AnACeS_base!N23","v":""},{"$f":"AnACeS_base!O23","v":""},{"$f":"AnACeS_base!P23","v":""},{"$f":"AnACeS_base!Q23","v":""},{"$f":"AnACeS_base!R23","v":""},{"$f":"AnACeS_base!S23","v":""},{"$f":"AnACeS_base!T23","v":""},{"$f":"AnACeS_base!U23","v":""},{"$f":"AnACeS_base!V23","v":""},{"$f":"AnACeS_base!W23","v":""},{"$f":"AnACeS_base!X23","v":""}]
[null,null,"PROPORÇÃO (%) DE BAIXO PESO À NASCENÇA"]
[null,null,"Continente",{"$f":"AnACeS_base!F24","v":6.524442592732874},{"$f":"AnACeS_base!G24","v":6.882311176702208},{"$f":"AnACeS_base!H24","v":7.071939215186493},{"$f":"AnACeS_base!I24","v":7.231042171712569},{"$f":"AnACeS_base!J24","v":7.1993268066916878},{"$f":"AnACeS_base!K24","v":7.3056344128911226},{"$f":"AnACeS_base!L24","v":7.4430417992465374},{"$f":"AnACeS_base!M24","v":7.5060470793485452},{"$f":"AnACeS_base!N24","v":7.5629319740766601},{"$f":"AnACeS_base!O24","v":7.6481880169833829},{"$f":"AnACeS_base!P24","v":7.7140296589391104},{"$f":"AnACeS_base!Q24","v":7.9181966614537762},{"$f":"AnACeS_base!R24","v":8.0821652838895535},{"$f":"AnACeS_base!S24","v":8.3258611340494841},{"$f":"AnACeS_base!T24","v":8.4403911561512643},{"$f":"AnACeS_base!U24","v":8.5551539051374732},{"$f":"AnACeS_base!V24","v":8.6671840940616942},{"$f":"AnACeS_base!W24","v":8.7876243650560433},{"$f":"AnACeS_base!X24","v":8.7618348865870601}]
[null,null,"Região Alentejo",{"$f":"AnACeS_base!F25","v":6.8372330344777312},{"$f":"AnACeS_base!G25","v":7.3212501783930346},{"$f":"AnACeS_base!H25","v":7.6138536723563996},{"$f":"AnACeS_base!I25","v":7.7687378500971986},{"$f":"AnACeS_base!J25","v":7.5305587892898718},{"$f":"AnACeS_base!K25","v":7.3582540735825406},{"$f":"AnACeS_base!L25","v":7.5353447019384925},{"$f":"AnACeS_base!M25","v":7.7018815433047809},{"$f":"AnACeS_base!N25","v":8.2117897295654814},{"$f":"AnACeS_base!O25","v":8.194897067005801},{"$f":"AnACeS_base!P25","v":8.5035397509968256},{"$f":"AnACeS_base!Q25","v":8.4335378323108383},{"$f":"AnACeS_base!R25","v":8.859429310484197},{"$f":"AnACeS_base!S25","v":8.8242483500366653},{"$f":"AnACeS_base!T25","v":8.7085113374958922},{"$f":"AnACeS_base!U25","v":8.5993598062116092},{"$f":"AnACeS_base!V25","v":8.5219952144303335},{"$f":"AnACeS_base!W25","v":8.8226923441798686},{"$f":"AnACeS_base!X25","v":8.8301462317210344}]
[null,null,{"$f":"AnACeS_base!D1","v":""},{"$f":"AnACeS_base!F26","v":""},{"$f":"AnACeS_base!G26","v":""},{"$f":"AnACeS_base!H26","v":""},{"$f":"AnACeS_base!I26","v":""},{"$f":"AnACeS_base!J26","v":""},{"$f":"AnACeS_base!K26","v":""},{"$f":"AnACeS_base!L26","v":""},{"$f":"AnACeS_base!M26","v":""},{"$f":"AnACeS_base!N26","v":""},{"$f":"AnACeS_base!O26","v":""},{"$f":"AnACeS_base!P26","v":""},{"$f":"AnACeS_base!Q26","v":""},{"$f":"AnACeS_base!R26","v":""},{"$f":"AnACeS_base!S26","v":""},{"$f":"AnACeS_base!T26","v":""},{"$f":"AnACeS_base!U26","v":""},{"$f":"AnACeS_base!V26","v":""},{"$f":"AnACeS_base!W26","v":""},{"$f":"AnACeS_base!X26","v":""}]
[]
[null,null,"Fonte: INE"]
[]
[null,null,"PROPORÇÃO (%) DE NASCIMENTOS EM MULHERES COM IDADE INFERIOR A 20 ANOS, 1996-2016 (MÉDIA ANUAL POR TRIÉNIOS)",null,null,null,null,null,null,null,"PROPORÇÃO (%) DE NASCIMENTOS EM MULHERES COM IDADE IGUAL OU SUPERIOR A 35 ANOS, 1996-2016 (MÉDIA ANUAL POR TRIÉNIOS)"]
[]
[]
[]
[]
[]
[]
[]
[]
[]
[]
[]
[]
[]
[]
[]
[null,null,"PROPORÇÃO (%) DE NASCIMENTOS PRÉ-TERMO, 1996-2016 (MÉDIA ANUAL POR TRIÉNIOS)",null,null,null,null,null,null,null,"PROPORÇÃO (%) DE BAIXO PESO À NASCENÇA, 1996-2016 (MÉDIA ANUAL POR TRIÉNIOS)"]
[]
[]
[]
[]
[]
[]
[]
[]
[]
[]
[]
[]
[]
[]
[]
[]
[]
[]
[null,null,"MORTALIDADE INFANTIL E COMPONENTES"]
[]
[null,null,"Local de residência","96-98","97-99","98-00","99-01","00-02","01-03","02-04","03-05","04-06","05-07","06-08","07-09","08-10","09-11","10-12","11-13","12-14","13-15","14-16"]
[]
[null,null,"TAXA DE MORTALIDADE INFANTIL"]
[null,null,"Continente",{"$f":"AnACeS_base!F27","v":6.2211196121505949},{"$f":"AnACeS_base!G27","v":5.8287886351023293},{"$f":"AnACeS_base!H27","v":5.5013411984609597},{"$f":"AnACeS_base!I27","v":5.173492760755579},{"$f":"AnACeS_base!J27","v":5.0154121022351354},{"$f":"AnACeS_base!K27","v":4.6119855532668748},{"$f":"AnACeS_base!L27","v":4.261439636424293},{"$f":"AnACeS_base!M27","v":3.7480708458881455},{"$f":"AnACeS_base!N27","v":3.4818986953485491},{"$f":"AnACeS_base!O27","v":3.3593505255650573},{"$f":"AnACeS_base!P27","v":3.3108439439287105},{"$f":"AnACeS_base!Q27","v":3.4136394011835787},{"$f":"AnACeS_base!R27","v":3.1017498290238121},{"$f":"AnACeS_base!S27","v":3.0444043564398542},{"$f":"AnACeS_base!T27","v":2.9435562113063312},{"$f":"AnACeS_base!U27","v":3.1062704411373487},{"$f":"AnACeS_base!V27","v":2.9889688883017369},{"$f":"AnACeS_base!W27","v":2.8294362117459384},{"$f":"AnACeS_base!X27","v":2.9553726366293085}]
[null,null,"Região Alentejo",{"$f":"AnACeS_base!F28","v":4.9566294919454768},{"$f":"AnACeS_base!G28","v":4.5668617097188529},{"$f":"AnACeS_base!H28","v":4.6037254763085205},{"$f":"AnACeS_base!I28","v":4.3199654402764782},{"$f":"AnACeS_base!J28","v":4.583818393480791},{"$f":"AnACeS_base!K28","v":4.6449900464498999},{"$f":"AnACeS_base!L28","v":4.8826701646990234},{"$f":"AnACeS_base!M28","v":4.4659199062888932},{"$f":"AnACeS_base!N28","v":3.7982376177453658},{"$f":"AnACeS_base!O28","v":3.6563071297989032},{"$f":"AnACeS_base!P28","v":3.8245585482952236},{"$f":"AnACeS_base!Q28","v":4.6625766871165641},{"$f":"AnACeS_base!R28","v":4.0417104518632287},{"$f":"AnACeS_base!S28","v":3.3406665037073249},{"$f":"AnACeS_base!T28","v":2.6289845547157413},{"$f":"AnACeS_base!U28","v":2.8549182455229691},{"$f":"AnACeS_base!V28","v":3.0369961347321923},{"$f":"AnACeS_base!W28","v":3.0357651076747936},{"$f":"AnACeS_base!X28","v":2.5309336332958381}]
[null,null,{"$f":"AnACeS_base!D1","v":""},{"$f":"AnACeS_base!F29","v":""},{"$f":"AnACeS_base!G29","v":""},{"$f":"AnACeS_base!H29","v":""},{"$f":"AnACeS_base!I29","v":""},{"$f":"AnACeS_base!J29","v":""},{"$f":"AnACeS_base!K29","v":""},{"$f":"AnACeS_base!L29","v":""},{"$f":"AnACeS_base!M29","v":""},{"$f":"AnACeS_base!N29","v":""},{"$f":"AnACeS_base!O29","v":""},{"$f":"AnACeS_base!P29","v":""},{"$f":"AnACeS_base!Q29","v":""},{"$f":"AnACeS_base!R29","v":""},{"$f":"AnACeS_base!S29","v":""},{"$f":"AnACeS_base!T29","v":""},{"$f":"AnACeS_base!U29","v":""},{"$f":"AnACeS_base!V29","v":""},{"$f":"AnACeS_base!W29","v":""},{"$f":"AnACeS_base!X29","v":""}]
[]
[null,null,"TAXA DE MORTALIDADE NEONATAL"]
[null,null,"Continente",{"$f":"AnACeS_base!F30","v":3.8759689922480618},{"$f":"AnACeS_base!G30","v":3.695700028213817},{"$f":"AnACeS_base!H30","v":3.4440277221473741},{"$f":"AnACeS_base!I30","v":3.1776121125956172},{"$f":"AnACeS_base!J30","v":3.1433981017656079},{"$f":"AnACeS_base!K30","v":2.9416988934350878},{"$f":"AnACeS_base!L30","v":2.8325669666040354},{"$f":"AnACeS_base!M30","v":2.4252223120452712},{"$f":"AnACeS_base!N30","v":2.2483863178023902},{"$f":"AnACeS_base!O30","v":2.1029267674916183},{"$f":"AnACeS_base!P30","v":2.0798457870440825},{"$f":"AnACeS_base!Q30","v":2.177013220532817},{"$f":"AnACeS_base!R30","v":2.0413520589677874},{"$f":"AnACeS_base!S30","v":2.1264756855225992},{"$f":"AnACeS_base!T30","v":2.050238157128788},{"$f":"AnACeS_base!U30","v":2.151698668294133},{"$f":"AnACeS_base!V30","v":2.0311777528238326},{"$f":"AnACeS_base!W30","v":1.9604550606607614},{"$f":"AnACeS_base!X30","v":2.1145134764167861}]
[null,null,"Região Alentejo",{"$f":"AnACeS_base!F31","v":3.2801224579050952},{"$f":"AnACeS_base!G31","v":3.1397174254317113},{"$f":"AnACeS_base!H31","v":2.6205821942063885},{"$f":"AnACeS_base!I31","v":2.5919792641658868},{"$f":"AnACeS_base!J31","v":2.9103608847497093},{"$f":"AnACeS_base!K31","v":3.1703900317039002},{"$f":"AnACeS_base!L31","v":3.570908030899286},{"$f":"AnACeS_base!M31","v":3.221319276667399},{"$f":"AnACeS_base!N31","v":2.9626253418413855},{"$f":"AnACeS_base!O31","v":2.3845481281297194},{"$f":"AnACeS_base!P31","v":2.1970868256164051},{"$f":"AnACeS_base!Q31","v":2.6175869120654394},{"$f":"AnACeS_base!R31","v":2.263357853043408},{"$f":"AnACeS_base!S31","v":2.1999511121975068},{"$f":"AnACeS_base!T31","v":2.1360499507065396},{"$f":"AnACeS_base!U31","v":2.2493295267756728},{"$f":"AnACeS_base!V31","v":2.3007546475243883},{"$f":"AnACeS_base!W31","v":1.7076178730670715},{"$f":"AnACeS_base!X31","v":1.4998125234345707}]
[null,null,{"$f":"AnACeS_base!D1","v":""},{"$f":"AnACeS_base!F32","v":""},{"$f":"AnACeS_base!G32","v":""},{"$f":"AnACeS_base!H32","v":""},{"$f":"AnACeS_base!I32","v":""},{"$f":"AnACeS_base!J32","v":""},{"$f":"AnACeS_base!K32","v":""},{"$f":"AnACeS_base!L32","v":""},{"$f":"AnACeS_base!M32","v":""},{"$f":"AnACeS_base!N32","v":""},{"$f":"AnACeS_base!O32","v":""},{"$f":"AnACeS_base!P32","v":""},{"$f":"AnACeS_base!Q32","v":""},{"$f":"AnACeS_base!R32","v":""},{"$f":"AnACeS_base!S32","v":""},{"$f":"AnACeS_base!T32","v":""},{"$f":"AnACeS_base!U32","v":""},{"$f":"AnACeS_base!V32","v":""},{"$f":"AnACeS_base!W32","v":""},{"$f":"AnACeS_base!X32","v":""}]
[]
[null,null,"TAXA DE MORTALIDADE NEONATAL PRECOCE"]
[null,null,"Continente",{"$f":"AnACeS_base!F33","v":2.843850213367674},{"$f":"AnACeS_base!G33","v":2.6787624365576663},{"$f":"AnACeS_base!H33","v":2.5792278095376813},{"$f":"AnACeS_base!I33","v":2.3573871886942626},{"$f":"AnACeS_base!J33","v":2.3476397074292126},{"$f":"AnACeS_base!K33","v":2.2093903765312257},{"$f":"AnACeS_base!L33","v":2.0835103687687462},{"$f":"AnACeS_base!M33","v":1.7510168998693127},{"$f":"AnACeS_base!N33","v":1.5859444854164899},{"$f":"AnACeS_base!O33","v":1.5530330802711474},{"$f":"AnACeS_base!P33","v":1.5286021069006916},{"$f":"AnACeS_base!Q33","v":1.5466438861063843},{"$f":"AnACeS_base!R33","v":1.3988960810185345},{"$f":"AnACeS_base!S33","v":1.3999298263023776},{"$f":"AnACeS_base!T33","v":1.3619439186641233},{"$f":"AnACeS_base!U33","v":1.4083845828834327},{"$f":"AnACeS_base!V33","v":1.391274192482991},{"$f":"AnACeS_base!W33","v":1.3307585743671551},{"$f":"AnACeS_base!X33","v":1.4055537923160311}]
[null,null,"Região Alentejo",{"$f":"AnACeS_base!F34","v":1.8222902543917197},{"$f":"AnACeS_base!G34","v":1.7839303553589267},{"$f":"AnACeS_base!H34","v":1.8414901905234082},{"$f":"AnACeS_base!I34","v":1.8719850241198071},{"$f":"AnACeS_base!J34","v":2.037252619324796},{"$f":"AnACeS_base!K34","v":2.2856300228563002},{"$f":"AnACeS_base!L34","v":2.6963999416994606},{"$f":"AnACeS_base!M34","v":2.6356248627278718},{"$f":"AnACeS_base!N34","v":2.4308720753570343},{"$f":"AnACeS_base!O34","v":1.9076385025037754},{"$f":"AnACeS_base!P34","v":1.8715924810806412},{"$f":"AnACeS_base!Q34","v":2.2085889570552149},{"$f":"AnACeS_base!R34","v":1.9400210168943497},{"$f":"AnACeS_base!S34","v":1.7925527580868574},{"$f":"AnACeS_base!T34","v":1.807426881367072},{"$f":"AnACeS_base!U34","v":1.9032788303486461},{"$f":"AnACeS_base!V34","v":1.8406037180195105},{"$f":"AnACeS_base!W34","v":1.3281472346077221},{"$f":"AnACeS_base!X34","v":1.124859392575928}]
[null,null,{"$f":"AnACeS_base!D1","v":""},{"$f":"AnACeS_base!F35","v":""},{"$f":"AnACeS_base!G35","v":""},{"$f":"AnACeS_base!H35","v":""},{"$f":"AnACeS_base!I35","v":""},{"$f":"AnACeS_base!J35","v":""},{"$f":"AnACeS_base!K35","v":""},{"$f":"AnACeS_base!L35","v":""},{"$f":"AnACeS_base!M35","v":""},{"$f":"AnACeS_base!N35","v":""},{"$f":"AnACeS_base!O35","v":""},{"$f":"AnACeS_base!P35","v":""},{"$f":"AnACeS_base!Q35","v":""},{"$f":"AnACeS_base!R35","v":""},{"$f":"AnACeS_base!S35","v":""},{"$f":"AnACeS_base!T35","v":""},{"$f":"AnACeS_base!U35","v":""},{"$f":"AnACeS_base!V35","v":""},{"$f":"AnACeS_base!W35","v":""},{"$f":"AnACeS_base!X35","v":""}]
[]
[null,null,"TAXA DE MORTALIDADE PÓS-NEONATAL"]
[null,null,"Continente",{"$f":"AnACeS_base!F36","v":2.3451506199025327},{"$f":"AnACeS_base!G36","v":2.1330886068885122},{"$f":"AnACeS_base!H36","v":2.0573134763135856},{"$f":"AnACeS_base!I36","v":1.995880648159962},{"$f":"AnACeS_base!J36","v":1.872014000469528},{"$f":"AnACeS_base!K36","v":1.6702866598317871},{"$f":"AnACeS_base!L36","v":1.4288726698202578},{"$f":"AnACeS_base!M36","v":1.322848533842875},{"$f":"AnACeS_base!N36","v":1.2335123775461587},{"$f":"AnACeS_base!O36","v":1.2564237580734392},{"$f":"AnACeS_base!P36","v":1.2309981568846278},{"$f":"AnACeS_base!Q36","v":1.2366261806507617},{"$f":"AnACeS_base!R36","v":1.0603977700560248},{"$f":"AnACeS_base!S36","v":0.91792867091725527},{"$f":"AnACeS_base!T36","v":0.8933180541775434},{"$f":"AnACeS_base!U36","v":0.95457177284321548},{"$f":"AnACeS_base!V36","v":0.95779113547790473},{"$f":"AnACeS_base!W36","v":0.86898115108517693},{"$f":"AnACeS_base!X36","v":0.84085916021252305}]
[null,null,"Região Alentejo",{"$f":"AnACeS_base!F37","v":1.6765070340403818},{"$f":"AnACeS_base!G37","v":1.4271442842871414},{"$f":"AnACeS_base!H37","v":1.9831432821021318},{"$f":"AnACeS_base!I37","v":1.727986176110591},{"$f":"AnACeS_base!J37","v":1.6734575087310826},{"$f":"AnACeS_base!K37","v":1.4746000147460001},{"$f":"AnACeS_base!L37","v":1.3117621337997378},{"$f":"AnACeS_base!M37","v":1.2446006296214949},{"$f":"AnACeS_base!N37","v":0.83561227590398057},{"$f":"AnACeS_base!O37","v":1.2717590016691835},{"$f":"AnACeS_base!P37","v":1.6274717226788185},{"$f":"AnACeS_base!Q37","v":2.0449897750511248},{"$f":"AnACeS_base!R37","v":1.7783525988198206},{"$f":"AnACeS_base!S37","v":1.1407153915098183},{"$f":"AnACeS_base!T37","v":0.49293460400920147},{"$f":"AnACeS_base!U37","v":0.60558871874729647},{"$f":"AnACeS_base!V37","v":0.73624148720780414},{"$f":"AnACeS_base!W37","v":1.3281472346077221},{"$f":"AnACeS_base!X37","v":1.0311211098612674}]
[null,null,{"$f":"AnACeS_base!D1","v":""},{"$f":"AnACeS_base!F38","v":""},{"$f":"AnACeS_base!G38","v":""},{"$f":"AnACeS_base!H38","v":""},{"$f":"AnACeS_base!I38","v":""},{"$f":"AnACeS_base!J38","v":""},{"$f":"AnACeS_base!K38","v":""},{"$f":"AnACeS_base!L38","v":""},{"$f":"AnACeS_base!M38","v":""},{"$f":"AnACeS_base!N38","v":""},{"$f":"AnACeS_base!O38","v":""},{"$f":"AnACeS_base!P38","v":""},{"$f":"AnACeS_base!Q38","v":""},{"$f":"AnACeS_base!R38","v":""},{"$f":"AnACeS_base!S38","v":""},{"$f":"AnACeS_base!T38","v":""},{"$f":"AnACeS_base!U38","v":""},{"$f":"AnACeS_base!V38","v":""},{"$f":"AnACeS_base!W38","v":""},{"$f":"AnACeS_base!X38","v":""}]
[]
[null,null,"TAXA DE MORTALIDADE FETAL TARDIA"]
[null,null,"Continente",{"$f":"AnACeS_base!F39","v":4.2022749488466529},{"$f":"AnACeS_base!G39","v":3.8513329874237145},{"$f":"AnACeS_base!H39","v":3.7364869767104403},{"$f":"AnACeS_base!I39","v":3.5537850535186712},{"$f":"AnACeS_base!J39","v":3.4636874903153472},{"$f":"AnACeS_base!K39","v":3.2087122906416181},{"$f":"AnACeS_base!L39","v":2.9685043570489427},{"$f":"AnACeS_base!M39","v":2.7594821350616741},{"$f":"AnACeS_base!N39","v":2.7855697075802643},{"$f":"AnACeS_base!O39","v":2.8446665824787152},{"$f":"AnACeS_base!P39","v":2.7688219185473972},{"$f":"AnACeS_base!Q39","v":2.6967511877728958},{"$f":"AnACeS_base!R39","v":2.5735458776756093},{"$f":"AnACeS_base!S39","v":2.5029607763420714},{"$f":"AnACeS_base!T39","v":2.4287446494572764},{"$f":"AnACeS_base!U39","v":2.3807479451413229},{"$f":"AnACeS_base!V39","v":2.3682140371253588},{"$f":"AnACeS_base!W39","v":2.3202827897002898},{"$f":"AnACeS_base!X39","v":2.3357472129354342}]
[null,null,"Região Alentejo",{"$f":"AnACeS_base!F40","v":3.7037037037037037},{"$f":"AnACeS_base!G40","v":4.4753853804077579},{"$f":"AnACeS_base!H40","v":4.9333991119881597},{"$f":"AnACeS_base!I40","v":5.8693006942953261},{"$f":"AnACeS_base!J40","v":5.4992764109985526},{"$f":"AnACeS_base!K40","v":4.6965583033683131},{"$f":"AnACeS_base!L40","v":3.992160847789795},{"$f":"AnACeS_base!M40","v":3.7925753045000365},{"$f":"AnACeS_base!N40","v":3.5576413594731662},{"$f":"AnACeS_base!O40","v":4.3526432415321299},{"$f":"AnACeS_base!P40","v":3.6484514350575648},{"$f":"AnACeS_base!Q40","v":3.8298565840938723},{"$f":"AnACeS_base!R40","v":3.4638311583695827},{"$f":"AnACeS_base!S40","v":3.2485990416632826},{"$f":"AnACeS_base!T40","v":3.8464686144529012},{"$f":"AnACeS_base!U40","v":3.5344827586206895},{"$f":"AnACeS_base!V40","v":3.6677058499908304},{"$f":"AnACeS_base!W40","v":2.8379528899820263},{"$f":"AnACeS_base!X40","v":2.8042624789680315}]
[null,null,{"$f":"AnACeS_base!D1","v":""},{"$f":"AnACeS_base!F41","v":""},{"$f":"AnACeS_base!G41","v":""},{"$f":"AnACeS_base!H41","v":""},{"$f":"AnACeS_base!I41","v":""},{"$f":"AnACeS_base!J41","v":""},{"$f":"AnACeS_base!K41","v":""},{"$f":"AnACeS_base!L41","v":""},{"$f":"AnACeS_base!M41","v":""},{"$f":"AnACeS_base!N41","v":""},{"$f":"AnACeS_base!O41","v":""},{"$f":"AnACeS_base!P41","v":""},{"$f":"AnACeS_base!Q41","v":""},{"$f":"AnACeS_base!R41","v":""},{"$f":"AnACeS_base!S41","v":""},{"$f":"AnACeS_base!T41","v":""},{"$f":"AnACeS_base!U41","v":""},{"$f":"AnACeS_base!V41","v":""},{"$f":"AnACeS_base!W41","v":""},{"$f":"AnACeS_base!X41","v":""}]
[]
[null,null,"TAXA DE MORTALIDADE PERINATAL"]
[null,null,"Continente",{"$f":"AnACeS_base!F42","v":7.0341745217044203},{"$f":"AnACeS_base!G42","v":6.5197786178439951},{"$f":"AnACeS_base!H42","v":6.3060775351278151},{"$f":"AnACeS_base!I42","v":5.9027945948563953},{"$f":"AnACeS_base!J42","v":5.8031957074581699},{"$f":"AnACeS_base!K42","v":5.4110133691168434},{"$f":"AnACeS_base!L42","v":5.0458298162100421},{"$f":"AnACeS_base!M42","v":4.5056671350776067},{"$f":"AnACeS_base!N42","v":4.3670964340802731},{"$f":"AnACeS_base!O42","v":4.3932818014449309},{"$f":"AnACeS_base!P42","v":4.2931915984297637},{"$f":"AnACeS_base!Q42","v":4.2392241601423608},{"$f":"AnACeS_base!R42","v":3.968841835451542},{"$f":"AnACeS_base!S42","v":3.8993866331995828},{"$f":"AnACeS_base!T42","v":3.7873807541160827},{"$f":"AnACeS_base!U42","v":3.785779519323087},{"$f":"AnACeS_base!V42","v":3.7561933945362216},{"$f":"AnACeS_base!W42","v":3.6479536278500948},{"$f":"AnACeS_base!X42","v":3.738017986898432}]
[null,null,"Região Alentejo",{"$f":"AnACeS_base!F43","v":5.5192447349310099},{"$f":"AnACeS_base!G43","v":6.2513319599346451},{"$f":"AnACeS_base!H43","v":6.7658044964409054},{"$f":"AnACeS_base!I43","v":7.7302984754133561},{"$f":"AnACeS_base!J43","v":7.5253256150506509},{"$f":"AnACeS_base!K43","v":6.9714537315623391},{"$f":"AnACeS_base!L43","v":6.67779632721202},{"$f":"AnACeS_base!M43","v":6.4182043614616004},{"$f":"AnACeS_base!N43","v":5.9798652637953227},{"$f":"AnACeS_base!O43","v":6.2519784742006959},{"$f":"AnACeS_base!P43","v":5.5132155018647646},{"$f":"AnACeS_base!Q43","v":6.0299869621903515},{"$f":"AnACeS_base!R43","v":5.3971322700177211},{"$f":"AnACeS_base!S43","v":5.0353285145780884},{"$f":"AnACeS_base!T43","v":5.6469432850478762},{"$f":"AnACeS_base!U43","v":5.431034482758621},{"$f":"AnACeS_base!V43","v":5.501558774986246},{"$f":"AnACeS_base!W43","v":4.1623309053069724},{"$f":"AnACeS_base!X43","v":3.9259674705552441}]
[null,null,{"$f":"AnACeS_base!D1","v":""},{"$f":"AnACeS_base!F44","v":""},{"$f":"AnACeS_base!G44","v":""},{"$f":"AnACeS_base!H44","v":""},{"$f":"AnACeS_base!I44","v":""},{"$f":"AnACeS_base!J44","v":""},{"$f":"AnACeS_base!K44","v":""},{"$f":"AnACeS_base!L44","v":""},{"$f":"AnACeS_base!M44","v":""},{"$f":"AnACeS_base!N44","v":""},{"$f":"AnACeS_base!O44","v":""},{"$f":"AnACeS_base!P44","v":""},{"$f":"AnACeS_base!Q44","v":""},{"$f":"AnACeS_base!R44","v":""},{"$f":"AnACeS_base!S44","v":""},{"$f":"AnACeS_base!T44","v":""},{"$f":"AnACeS_base!U44","v":""},{"$f":"AnACeS_base!V44","v":""},{"$f":"AnACeS_base!W44","v":""},{"$f":"AnACeS_base!X44","v":""}]
[]
[null,null,"Fonte: INE"]
[]
[null,null,"TAXA DE MORTALIDADE INFANTIL (/1000 NADOS VIVOS), 1996-2016 (MÉDIA ANUAL POR TRIÉNIOS)",null,null,null,null,null,null,null,"TAXA DE MORTALIDADE NEONATAL (/1000 NADOS VIVOS), 1996-2016 (MÉDIA ANUAL POR TRIÉNIOS)"]
[]
[]
[]
[]
[]
[]
[]
[]
[]
[]
[]
[]
[]
[]
[null,null,"TAXA DE MORTALIDADE NEONATAL PRECOCE (/1000 NADOS VIVOS), 1996-2016 (MÉDIA ANUAL POR TRIÉNIOS)",null,null,null,null,null,null,null,"TAXA DE MORTALIDADE PÓS-NEONATAL (/1000 NADOS VIVOS), 1996-2016 (MÉDIA ANUAL POR TRIÉNIOS)"]
[]
[]
[]
[]
[]
[]
[]
[]
[]
[]
[]
[]
[]
[]
[null,null,"TAXA DE MORTALIDADE FETAL TARDIA (/1000 (NV+FM 28+ SEM)), 1996-2016 (MÉDIA ANUAL POR TRIÉNIOS)",null,null,null,null,null,null,null,"TAXA DE MORTALIDADE PERINATAL (/1000 (NV+FM 28+ SEM)), 1996-2016 (MÉDIA ANUAL POR TRIÉNIOS)"]

{"sheet":"AnACeS_base","index":8,"n_rows":44,"n_cols":26,"rows_kept":44,"cut":false,"hidden":true,"merged":[]}
[null,"AnACeS_Select",1,{"$f":"IF(AnACeS_Select=1,\"\",VLOOKUP(AnACeS_Select,AnACeS_tab,3,FALSE))","v":""}]
[null,null,null,null,null,2,3,4,5,6,7,8,9,10,11,12,13,14,15,16,17,18,19,20,21,22]
["Icod","Indicador","Rcod","Local_Residencia","cod_IndRes",1996,1997,1998,1999,2000,2001,2002,2003,2004,2005,2006,2007,2008,2009,2010,2011,2012,2013,2014,2015,2016]
["I02","Taxa Bruta de Natalidade","R01","Continente","I02R01",{"$f":"IF(AnACeS_base!$C4=\"\",\"\",VLOOKUP($E4,BaseAnual,F2,FALSE))","v":10.821126059730386},{"$f":"IF(AnACeS_base!$C4=\"\",\"\",VLOOKUP($E4,BaseAnual,G2,FALSE))","v":11.042744601820905},{"$f":"IF(AnACeS_base!$C4=\"\",\"\",VLOOKUP($E4,BaseAnual,H2,FALSE))","v":11.041624559345594},{"$f":"IF(AnACeS_base!$C4=\"\",\"\",VLOOKUP($E4,BaseAnual,I2,FALSE))","v":11.236130496118188},{"$f":"IF(AnACeS_base!$C4=\"\",\"\",VLOOKUP($E4,BaseAnual,J2,FALSE))","v":11.556765735318571},{"$f":"IF(AnACeS_base!$C4=\"\",\"\",VLOOKUP($E4,BaseAnual,K2,FALSE))","v":10.783038429112857},{"$f":"IF(AnACeS_base!$C4=\"\",\"\",VLOOKUP($E4,BaseAnual,L2,FALSE))","v":10.898670928677733},{"$f":"IF(AnACeS_base!$C4=\"\",\"\",VLOOKUP($E4,BaseAnual,M2,FALSE))","v":10.663047809664718},{"$f":"IF(AnACeS_base!$C4=\"\",\"\",VLOOKUP($E4,BaseAnual,N2,FALSE))","v":10.346899410558548},{"$f":"IF(AnACeS_base!$C4=\"\",\"\",VLOOKUP($E4,BaseAnual,O2,FALSE))","v":10.340910585069862},{"$f":"IF(AnACeS_base!$C4=\"\",\"\",VLOOKUP($E4,BaseAnual,P2,FALSE))","v":9.9543378083745289},{"$f":"IF(AnACeS_base!$C4=\"\",\"\",VLOOKUP($E4,BaseAnual,Q2,FALSE))","v":9.6590035416180218},{"$f":"IF(AnACeS_base!$C4=\"\",\"\",VLOOKUP($E4,BaseAnual,R2,FALSE))","v":9.8590047955866638},{"$f":"IF(AnACeS_base!$C4=\"\",\"\",VLOOKUP($E4,BaseAnual,S2,FALSE))","v":9.3803064680297972},{"$f":"IF(AnACeS_base!$C4=\"\",\"\",VLOOKUP($E4,BaseAnual,T2,FALSE))","v":9.5569792875117994},{"$f":"IF(AnACeS_base!$C4=\"\",\"\",VLOOKUP($E4,BaseAnual,U2,FALSE))","v":9.1293892811910133},{"$f":"IF(AnACeS_base!$C4=\"\",\"\",VLOOKUP($E4,BaseAnual,V2,FALSE))","v":8.527352357854511},{"$f":"IF(AnACeS_base!$C4=\"\",\"\",VLOOKUP($E4,BaseAnual,W2,FALSE))","v":7.9020077056789138},{"$f":"IF(AnACeS_base!$C4=\"\",\"\",VLOOKUP($E4,BaseAnual,X2,FALSE))","v":7.9149676645291613},{"$f":"IF(AnACeS_base!$C4=\"\",\"\",VLOOKUP($E4,BaseAnual,Y2,FALSE))","v":8.2492584703892753},{"$f":"IF(AnACeS_base!$C4=\"\",\"\",VLOOKUP($E4,BaseAnual,Z2,FALSE))","v":8.4489677968159906}]
["I02","Taxa Bruta de Natalidade","R02","Região Alentejo","I02R02",{"$f":"IF(AnACeS_base!$C5=\"\",\"\",VLOOKUP($E5,BaseAnual,F2,FALSE))","v":8.1189247830502431},{"$f":"IF(AnACeS_base!$C5=\"\",\"\",VLOOKUP($E5,BaseAnual,G2,FALSE))","v":8.6650324312897968},{"$f":"IF(AnACeS_base!$C5=\"\",\"\",VLOOKUP($E5,BaseAnual,H2,FALSE))","v":8.6510385243592829},{"$f":"IF(AnACeS_base!$C5=\"\",\"\",VLOOKUP($E5,BaseAnual,I2,FALSE))","v":8.7376206944432795},{"$f":"IF(AnACeS_base!$C5=\"\",\"\",VLOOKUP($E5,BaseAnual,J2,FALSE))","v":8.9186300999099366},{"$f":"IF(AnACeS_base!$C5=\"\",\"\",VLOOKUP($E5,BaseAnual,K2,FALSE))","v":8.2664939730100748},{"$f":"IF(AnACeS_base!$C5=\"\",\"\",VLOOKUP($E5,BaseAnual,L2,FALSE))","v":8.5115551433737089},{"$f":"IF(AnACeS_base!$C5=\"\",\"\",VLOOKUP($E5,BaseAnual,M2,FALSE))","v":8.6459504903196187},{"$f":"IF(AnACeS_base!$C5=\"\",\"\",VLOOKUP($E5,BaseAnual,N2,FALSE))","v":8.6542229945084781},{"$f":"IF(AnACeS_base!$C5=\"\",\"\",VLOOKUP($E5,BaseAnual,O2,FALSE))","v":8.5004971272873551},{"$f":"IF(AnACeS_base!$C5=\"\",\"\",VLOOKUP($E5,BaseAnual,P2,FALSE))","v":7.8220045841294539},{"$f":"IF(AnACeS_base!$C5=\"\",\"\",VLOOKUP($E5,BaseAnual,Q2,FALSE))","v":7.6612424278417866},{"$f":"IF(AnACeS_base!$C5=\"\",\"\",VLOOKUP($E5,BaseAnual,R2,FALSE))","v":8.068174922193549},{"$f":"IF(AnACeS_base!$C5=\"\",\"\",VLOOKUP($E5,BaseAnual,S2,FALSE))","v":7.8264914524944755},{"$f":"IF(AnACeS_base!$C5=\"\",\"\",VLOOKUP($E5,BaseAnual,T2,FALSE))","v":8.0848785463993025},{"$f":"IF(AnACeS_base!$C5=\"\",\"\",VLOOKUP($E5,BaseAnual,U2,FALSE))","v":8.0375346974870432},{"$f":"IF(AnACeS_base!$C5=\"\",\"\",VLOOKUP($E5,BaseAnual,V2,FALSE))","v":7.8072867348507007},{"$f":"IF(AnACeS_base!$C5=\"\",\"\",VLOOKUP($E5,BaseAnual,W2,FALSE))","v":7.0722462391148078},{"$f":"IF(AnACeS_base!$C5=\"\",\"\",VLOOKUP($E5,BaseAnual,X2,FALSE))","v":6.8846222831126118},{"$f":"IF(AnACeS_base!$C5=\"\",\"\",VLOOKUP($E5,BaseAnual,Y2,FALSE))","v":7.4264983299631036},{"$f":"IF(AnACeS_base!$C5=\"\",\"\",VLOOKUP($E5,BaseAnual,Z2,FALSE))","v":7.6142475285950475}]
["I02","Taxa Bruta de Natalidade",{"$f":"IF(AnACeS_Select=1,\"\",VLOOKUP(AnACeS_Select,AnACeS_tab,2,FALSE))","v":""},{"$f":"IF(AnACeS_Select=1,\"\",VLOOKUP(AnACeS_Select,AnACeS_tab,3,FALSE))","v":""},{"$f":"IF(C6=\"\",\"\",CONCATENATE(A6,C6))","v":""},{"$f":"IF(AnACeS_base!$C6=\"\",\"\",VLOOKUP($E6,BaseAnual,F2,FALSE))","v":""},{"$f":"IF(AnACeS_base!$C6=\"\",\"\",VLOOKUP($E6,BaseAnual,G2,FALSE))","v":""},{"$f":"IF(AnACeS_base!$C6=\"\",\"\",VLOOKUP($E6,BaseAnual,H2,FALSE))","v":""},{"$f":"IF(AnACeS_base!$C6=\"\",\"\",VLOOKUP($E6,BaseAnual,I2,FALSE))","v":""},{"$f":"IF(AnACeS_base!$C6=\"\",\"\",VLOOKUP($E6,BaseAnual,J2,FALSE))","v":""},{"$f":"IF(AnACeS_base!$C6=\"\",\"\",VLOOKUP($E6,BaseAnual,K2,FALSE))","v":""},{"$f":"IF(AnACeS_base!$C6=\"\",\"\",VLOOKUP($E6,BaseAnual,L2,FALSE))","v":""},{"$f":"IF(AnACeS_base!$C6=\"\",\"\",VLOOKUP($E6,BaseAnual,M2,FALSE))","v":""},{"$f":"IF(AnACeS_base!$C6=\"\",\"\",VLOOKUP($E6,BaseAnual,N2,FALSE))","v":""},{"$f":"IF(AnACeS_base!$C6=\"\",\"\",VLOOKUP($E6,BaseAnual,O2,FALSE))","v":""},{"$f":"IF(AnACeS_base!$C6=\"\",\"\",VLOOKUP($E6,BaseAnual,P2,FALSE))","v":""},{"$f":"IF(AnACeS_base!$C6=\"\",\"\",VLOOKUP($E6,BaseAnual,Q2,FALSE))","v":""},{"$f":"IF(AnACeS_base!$C6=\"\",\"\",VLOOKUP($E6,BaseAnual,R2,FALSE))","v":""},{"$f":"IF(AnACeS_base!$C6=\"\",\"\",VLOOKUP($E6,BaseAnual,S2,FALSE))","v":""},{"$f":"IF(AnACeS_base!$C6=\"\",\"\",VLOOKUP($E6,BaseAnual,T2,FALSE))","v":""},{"$f":"IF(AnACeS_base!$C6=\"\",\"\",VLOOKUP($E6,BaseAnual,U2,FALSE))","v":""},{"$f":"IF(AnACeS_base!$C6=\"\",\"\",VLOOKUP($E6,BaseAnual,V2,FALSE))","v":""},{"$f":"IF(AnACeS_base!$C6=\"\",\"\",VLOOKUP($E6,BaseAnual,$W$2,FALSE))","v":""},{"$f":"IF(AnACeS_base!$C6=\"\",\"\",VLOOKUP($E6,BaseAnual,$X$2,FALSE))","v":""},{"$f":"IF(AnACeS_base!$C6=\"\",\"\",VLOOKUP($E6,BaseAnual,$Y$2,FALSE))","v":""},{"$f":"IF(AnACeS_base!$C6=\"\",\"\",VLOOKUP($E6,BaseAnual,$Z$2,FALSE))","v":""}]
["I13","Taxa Bruta de Mortalidade","R01","Continente","I13R01",{"$f":"IF(AnACeS_base!$C7=\"\",\"\",VLOOKUP($E7,BaseAnual,F2,FALSE))","v":10.591275772433184},{"$f":"IF(AnACeS_base!$C7=\"\",\"\",VLOOKUP($E7,BaseAnual,G2,FALSE))","v":10.321375458978128},{"$f":"IF(AnACeS_base!$C7=\"\",\"\",VLOOKUP($E7,BaseAnual,H2,FALSE))","v":10.420296162746913},{"$f":"IF(AnACeS_base!$C7=\"\",\"\",VLOOKUP($E7,BaseAnual,I2,FALSE))","v":10.546231405673506},{"$f":"IF(AnACeS_base!$C7=\"\",\"\",VLOOKUP($E7,BaseAnual,J2,FALSE))","v":10.200667728095262},{"$f":"IF(AnACeS_base!$C7=\"\",\"\",VLOOKUP($E7,BaseAnual,K2,FALSE))","v":10.097142437599212},{"$f":"IF(AnACeS_base!$C7=\"\",\"\",VLOOKUP($E7,BaseAnual,L2,FALSE))","v":10.162100000785729},{"$f":"IF(AnACeS_base!$C7=\"\",\"\",VLOOKUP($E7,BaseAnual,M2,FALSE))","v":10.370855888455157},{"$f":"IF(AnACeS_base!$C7=\"\",\"\",VLOOKUP($E7,BaseAnual,N2,FALSE))","v":9.7096139760912301},{"$f":"IF(AnACeS_base!$C7=\"\",\"\",VLOOKUP($E7,BaseAnual,O2,FALSE))","v":10.231222140747473},{"$f":"IF(AnACeS_base!$C7=\"\",\"\",VLOOKUP($E7,BaseAnual,P2,FALSE))","v":9.6872928529785245},{"$f":"IF(AnACeS_base!$C7=\"\",\"\",VLOOKUP($E7,BaseAnual,Q2,FALSE))","v":9.8327011755931615},{"$f":"IF(AnACeS_base!$C7=\"\",\"\",VLOOKUP($E7,BaseAnual,R2,FALSE))","v":9.8932426349082832},{"$f":"IF(AnACeS_base!$C7=\"\",\"\",VLOOKUP($E7,BaseAnual,S2,FALSE))","v":9.8786389784332709},{"$f":"IF(AnACeS_base!$C7=\"\",\"\",VLOOKUP($E7,BaseAnual,T2,FALSE))","v":10.024623390665301},{"$f":"IF(AnACeS_base!$C7=\"\",\"\",VLOOKUP($E7,BaseAnual,U2,FALSE))","v":9.7528160606764889},{"$f":"IF(AnACeS_base!$C7=\"\",\"\",VLOOKUP($E7,BaseAnual,V2,FALSE))","v":10.276886047948638},{"$f":"IF(AnACeS_base!$C7=\"\",\"\",VLOOKUP($E7,BaseAnual,W2,FALSE))","v":10.219049351459049},{"$f":"IF(AnACeS_base!$C7=\"\",\"\",VLOOKUP($E7,BaseAnual,X2,FALSE))","v":10.080385253309135},{"$f":"IF(AnACeS_base!$C7=\"\",\"\",VLOOKUP($E7,BaseAnual,Y2,FALSE))","v":10.514425369666318},{"$f":"IF(AnACeS_base!$C7=\"\",\"\",VLOOKUP($E7,BaseAnual,Z2,FALSE))","v":10.739925187370021}]
["I13","Taxa Bruta de Mortalidade","R02","Região Alentejo","I13R02",{"$f":"IF(AnACeS_base!$C$8=\"\",\"\",VLOOKUP($E$8,BaseAnual,F2,FALSE))","v":14.727910675194034},{"$f":"IF(AnACeS_base!$C$8=\"\",\"\",VLOOKUP($E$8,BaseAnual,G2,FALSE))","v":14.183358242442898},{"$f":"IF(AnACeS_base!$C$8=\"\",\"\",VLOOKUP($E$8,BaseAnual,H2,FALSE))","v":14.572714367919204},{"$f":"IF(AnACeS_base!$C$8=\"\",\"\",VLOOKUP($E$8,BaseAnual,I2,FALSE))","v":14.703730729194334},{"$f":"IF(AnACeS_base!$C$8=\"\",\"\",VLOOKUP($E$8,BaseAnual,J2,FALSE))","v":14.09285417629134},{"$f":"IF(AnACeS_base!$C$8=\"\",\"\",VLOOKUP($E$8,BaseAnual,K2,FALSE))","v":13.933238202303892},{"$f":"IF(AnACeS_base!$C$8=\"\",\"\",VLOOKUP($E$8,BaseAnual,L2,FALSE))","v":14.186549756906388},{"$f":"IF(AnACeS_base!$C$8=\"\",\"\",VLOOKUP($E$8,BaseAnual,M2,FALSE))","v":14.974778726109379},{"$f":"IF(AnACeS_base!$C$8=\"\",\"\",VLOOKUP($E$8,BaseAnual,N2,FALSE))","v":13.360971947436266},{"$f":"IF(AnACeS_base!$C$8=\"\",\"\",VLOOKUP($E$8,BaseAnual,O2,FALSE))","v":14.978331322054995},{"$f":"IF(AnACeS_base!$C$8=\"\",\"\",VLOOKUP($E$8,BaseAnual,P2,FALSE))","v":13.502587630477977},{"$f":"IF(AnACeS_base!$C$8=\"\",\"\",VLOOKUP($E$8,BaseAnual,Q2,FALSE))","v":13.929705849671825},{"$f":"IF(AnACeS_base!$C$8=\"\",\"\",VLOOKUP($E$8,BaseAnual,R2,FALSE))","v":14.521944260624398},{"$f":"IF(AnACeS_base!$C$8=\"\",\"\",VLOOKUP($E$8,BaseAnual,S2,FALSE))","v":14.300112416172423},{"$f":"IF(AnACeS_base!$C$8=\"\",\"\",VLOOKUP($E$8,BaseAnual,T2,FALSE))","v":14.566434978168877},{"$f":"IF(AnACeS_base!$C$8=\"\",\"\",VLOOKUP($E$8,BaseAnual,U2,FALSE))","v":14.182613181360386},{"$f":"IF(AnACeS_base!$C$8=\"\",\"\",VLOOKUP($E$8,BaseAnual,V2,FALSE))","v":14.857046537338443},{"$f":"IF(AnACeS_base!$C$8=\"\",\"\",VLOOKUP($E$8,BaseAnual,W2,FALSE))","v":14.288660578234222},{"$f":"IF(AnACeS_base!$C$8=\"\",\"\",VLOOKUP($E$8,BaseAnual,X2,FALSE))","v":14.152286547829075},{"$f":"IF(AnACeS_base!$C$8=\"\",\"\",VLOOKUP($E$8,BaseAnual,Y2,FALSE))","v":15.346451698461962},{"$f":"IF(AnACeS_base!$C$8=\"\",\"\",VLOOKUP($E$8,BaseAnual,Z2,FALSE))","v":15.365838685746333}]
["I13","Taxa Bruta de Mortalidade",{"$f":"IF(AnACeS_Select=1,\"\",VLOOKUP(AnACeS_Select,AnACeS_tab,2,FALSE))","v":""},{"$f":"IF(AnACeS_Select=1,\"\",VLOOKUP(AnACeS_Select,AnACeS_tab,3,FALSE))","v":""},{"$f":"IF(C6=\"\",\"\",CONCATENATE(A9,C9))","v":""},{"$f":"IF(AnACeS_base!$C9=\"\",\"\",VLOOKUP($E9,BaseAnual,F2,FALSE))","v":""},{"$f":"IF(AnACeS_base!$C9=\"\",\"\",VLOOKUP($E9,BaseAnual,G2,FALSE))","v":""},{"$f":"IF(AnACeS_base!$C9=\"\",\"\",VLOOKUP($E9,BaseAnual,H2,FALSE))","v":""},{"$f":"IF(AnACeS_base!$C9=\"\",\"\",VLOOKUP($E9,BaseAnual,I2,FALSE))","v":""},{"$f":"IF(AnACeS_base!$C9=\"\",\"\",VLOOKUP($E9,BaseAnual,J2,FALSE))","v":""},{"$f":"IF(AnACeS_base!$C9=\"\",\"\",VLOOKUP($E9,BaseAnual,K2,FALSE))","v":""},{"$f":"IF(AnACeS_base!$C9=\"\",\"\",VLOOKUP($E9,BaseAnual,L2,FALSE))","v":""},{"$f":"IF(AnACeS_base!$C9=\"\",\"\",VLOOKUP($E9,BaseAnual,M2,FALSE))","v":""},{"$f":"IF(AnACeS_base!$C9=\"\",\"\",VLOOKUP($E9,BaseAnual,N2,FALSE))","v":""},{"$f":"IF(AnACeS_base!$C9=\"\",\"\",VLOOKUP($E9,BaseAnual,O2,FALSE))","v":""},{"$f":"IF(AnACeS_base!$C9=\"\",\"\",VLOOKUP($E9,BaseAnual,P2,FALSE))","v":""},{"$f":"IF(AnACeS_base!$C9=\"\",\"\",VLOOKUP($E9,BaseAnual,Q2,FALSE))","v":""},{"$f":"IF(AnACeS_base!$C9=\"\",\"\",VLOOKUP($E9,BaseAnual,R2,FALSE))","v":""},{"$f":"IF(AnACeS_base!$C9=\"\",\"\",VLOOKUP($E9,BaseAnual,S2,FALSE))","v":""},{"$f":"IF(AnACeS_base!$C9=\"\",\"\",VLOOKUP($E9,BaseAnual,T2,FALSE))","v":""},{"$f":"IF(AnACeS_base!$C9=\"\",\"\",VLOOKUP($E9,BaseAnual,U2,FALSE))","v":""},{"$f":"IF(AnACeS_base!$C9=\"\",\"\",VLOOKUP($E9,BaseAnual,V2,FALSE))","v":""},{"$f":"IF(AnACeS_base!$C9=\"\",\"\",VLOOKUP($E9,BaseAnual,$W$2,FALSE))","v":""},{"$f":"IF(AnACeS_base!$C9=\"\",\"\",VLOOKUP($E9,BaseAnual,$X$2,FALSE))","v":""},{"$f":"IF(AnACeS_base!$C9=\"\",\"\",VLOOKUP($E9,BaseAnual,$Y$2,FALSE))","v":""},{"$f":"IF(AnACeS_base!$C9=\"\",\"\",VLOOKUP($E9,BaseAnual,$Z$2,FALSE))","v":""}]
["I11","Índice sintético de fecundidade (ISF)","R01","Continente","I11R01",{"$f":"IF(AnACeS_base!$C10=\"\",\"\",VLOOKUP($E10,BaseAnual,F2,FALSE))","v":1.43273764133683},{"$f":"IF(AnACeS_base!$C10=\"\",\"\",VLOOKUP($E10,BaseAnual,G2,FALSE))","v":1.4611013039185572},{"$f":"IF(AnACeS_base!$C10=\"\",\"\",VLOOKUP($E10,BaseAnual,H2,FALSE))","v":1.4637021530801475},{"$f":"IF(AnACeS_base!$C10=\"\",\"\",VLOOKUP($E10,BaseAnual,I2,FALSE))","v":1.4938896550464988},{"$f":"IF(AnACeS_base!$C10=\"\",\"\",VLOOKUP($E10,BaseAnual,J2,FALSE))","v":1.5426097879157423},{"$f":"IF(AnACeS_base!$C10=\"\",\"\",VLOOKUP($E10,BaseAnual,K2,FALSE))","v":1.4442204917011185},{"$f":"IF(AnACeS_base!$C10=\"\",\"\",VLOOKUP($E10,BaseAnual,L2,FALSE))","v":1.4624444371409304},{"$f":"IF(AnACeS_base!$C10=\"\",\"\",VLOOKUP($E10,BaseAnual,M2,FALSE))","v":1.4351019148859052},{"$f":"IF(AnACeS_base!$C10=\"\",\"\",VLOOKUP($E10,BaseAnual,N2,FALSE))","v":1.402336090443824},{"$f":"IF(AnACeS_base!$C10=\"\",\"\",VLOOKUP($E10,BaseAnual,O2,FALSE))","v":1.4135648144842672},{"$f":"IF(AnACeS_base!$C10=\"\",\"\",VLOOKUP($E10,BaseAnual,P2,FALSE))","v":1.3742621168427569},{"$f":"IF(AnACeS_base!$C10=\"\",\"\",VLOOKUP($E10,BaseAnual,Q2,FALSE))","v":1.3502316877831153},{"$f":"IF(AnACeS_base!$C10=\"\",\"\",VLOOKUP($E10,BaseAnual,R2,FALSE))","v":1.3827809255730685},{"$f":"IF(AnACeS_base!$C10=\"\",\"\",VLOOKUP($E10,BaseAnual,S2,FALSE))","v":1.347474588283234},{"$f":"IF(AnACeS_base!$C10=\"\",\"\",VLOOKUP($E10,BaseAnual,T2,FALSE))","v":1.3942369399420746},{"$f":"IF(AnACeS_base!$C10=\"\",\"\",VLOOKUP($E10,BaseAnual,U2,FALSE))","v":1.3498754066360792},{"$f":"IF(AnACeS_base!$C10=\"\",\"\",VLOOKUP($E10,BaseAnual,V2,FALSE))","v":1.2877062357186866},{"$f":"IF(AnACeS_base!$C10=\"\",\"\",VLOOKUP($E10,BaseAnual,W2,FALSE))","v":1.2146438843553757},{"$f":"IF(AnACeS_base!$C10=\"\",\"\",VLOOKUP($E10,BaseAnual,X2,FALSE))","v":1.2487321970436993},{"$f":"IF(AnACeS_base!$C10=\"\",\"\",VLOOKUP($E10,BaseAnual,Y2,FALSE))","v":1.3092241618587122},{"$f":"IF(AnACeS_base!$C10=\"\",\"\",VLOOKUP($E10,BaseAnual,Z2,FALSE))","v":1.3671414567907798}]
["I11","Índice sintético de fecundidade (ISF)","R02","Região Alentejo","I11R02",{"$f":"IF(AnACeS_base!$C11=\"\",\"\",VLOOKUP($E11,BaseAnual,F2,FALSE))","v":1.2859596145055816},{"$f":"IF(AnACeS_base!$C11=\"\",\"\",VLOOKUP($E11,BaseAnual,G2,FALSE))","v":1.372540746974485},{"$f":"IF(AnACeS_base!$C11=\"\",\"\",VLOOKUP($E11,BaseAnual,H2,FALSE))","v":1.373741706312408},{"$f":"IF(AnACeS_base!$C11=\"\",\"\",VLOOKUP($E11,BaseAnual,I2,FALSE))","v":1.3928736056310318},{"$f":"IF(AnACeS_base!$C11=\"\",\"\",VLOOKUP($E11,BaseAnual,J2,FALSE))","v":1.4270982345666559},{"$f":"IF(AnACeS_base!$C11=\"\",\"\",VLOOKUP($E11,BaseAnual,K2,FALSE))","v":1.3237471732131325},{"$f":"IF(AnACeS_base!$C11=\"\",\"\",VLOOKUP($E11,BaseAnual,L2,FALSE))","v":1.3577297198797247},{"$f":"IF(AnACeS_base!$C11=\"\",\"\",VLOOKUP($E11,BaseAnual,M2,FALSE))","v":1.3762893632416635},{"$f":"IF(AnACeS_base!$C11=\"\",\"\",VLOOKUP($E11,BaseAnual,N2,FALSE))","v":1.3799755254182491},{"$f":"IF(AnACeS_base!$C11=\"\",\"\",VLOOKUP($E11,BaseAnual,O2,FALSE))","v":1.3605629497644305},{"$f":"IF(AnACeS_base!$C11=\"\",\"\",VLOOKUP($E11,BaseAnual,P2,FALSE))","v":1.257385165490317},{"$f":"IF(AnACeS_base!$C11=\"\",\"\",VLOOKUP($E11,BaseAnual,Q2,FALSE))","v":1.2410718359326536},{"$f":"IF(AnACeS_base!$C11=\"\",\"\",VLOOKUP($E11,BaseAnual,R2,FALSE))","v":1.3018947762686799},{"$f":"IF(AnACeS_base!$C11=\"\",\"\",VLOOKUP($E11,BaseAnual,S2,FALSE))","v":1.2906670895511194},{"$f":"IF(AnACeS_base!$C11=\"\",\"\",VLOOKUP($E11,BaseAnual,T2,FALSE))","v":1.3526167146665977},{"$f":"IF(AnACeS_base!$C11=\"\",\"\",VLOOKUP($E11,BaseAnual,U2,FALSE))","v":1.3612773054411618},{"$f":"IF(AnACeS_base!$C11=\"\",\"\",VLOOKUP($E11,BaseAnual,V2,FALSE))","v":1.3411172216283358},{"$f":"IF(AnACeS_base!$C11=\"\",\"\",VLOOKUP($E11,BaseAnual,W2,FALSE))","v":1.230931478497683},{"$f":"IF(AnACeS_base!$C11=\"\",\"\",VLOOKUP($E11,BaseAnual,X2,FALSE))","v":1.2656182993225777},{"$f":"IF(AnACeS_base!$C11=\"\",\"\",VLOOKUP($E11,BaseAnual,Y2,FALSE))","v":1.3290441404849516},{"$f":"IF(AnACeS_base!$C11=\"\",\"\",VLOOKUP($E11,BaseAnual,Z2,FALSE))","v":1.3875032622281398}]
["I11","Índice sintético de fecundidade (ISF)",{"$f":"IF(AnACeS_Select=1,\"\",VLOOKUP(AnACeS_Select,AnACeS_tab,2,FALSE))","v":""},{"$f":"IF(AnACeS_Select=1,\"\",VLOOKUP(AnACeS_Select,AnACeS_tab,3,FALSE))","v":""},{"$f":"IF(C12=\"\",\"\",CONCATENATE(A12,C12))","v":""},{"$f":"IF(AnACeS_base!$C12=\"\",\"\",VLOOKUP($E12,BaseAnual,F2,FALSE))","v":""},{"$f":"IF(AnACeS_base!$C12=\"\",\"\",VLOOKUP($E12,BaseAnual,G2,FALSE))","v":""},{"$f":"IF(AnACeS_base!$C12=\"\",\"\",VLOOKUP($E12,BaseAnual,H2,FALSE))","v":""},{"$f":"IF(AnACeS_base!$C12=\"\",\"\",VLOOKUP($E12,BaseAnual,I2,FALSE))","v":""},{"$f":"IF(AnACeS_base!$C12=\"\",\"\",VLOOKUP($E12,BaseAnual,J2,FALSE))","v":""},{"$f":"IF(AnACeS_base!$C12=\"\",\"\",VLOOKUP($E12,BaseAnual,K2,FALSE))","v":""},{"$f":"IF(AnACeS_base!$C12=\"\",\"\",VLOOKUP($E12,BaseAnual,L2,FALSE))","v":""},{"$f":"IF(AnACeS_base!$C12=\"\",\"\",VLOOKUP($E12,BaseAnual,M2,FALSE))","v":""},{"$f":"IF(AnACeS_base!$C12=\"\",\"\",VLOOKUP($E12,BaseAnual,N2,FALSE))","v":""},{"$f":"IF(AnACeS_base!$C12=\"\",\"\",VLOOKUP($E12,BaseAnual,O2,FALSE))","v":""},{"$f":"IF(AnACeS_base!$C12=\"\",\"\",VLOOKUP($E12,BaseAnual,P2,FALSE))","v":""},{"$f":"IF(AnACeS_base!$C12=\"\",\"\",VLOOKUP($E12,BaseAnual,Q2,FALSE))","v":""},{"$f":"IF(AnACeS_base!$C12=\"\",\"\",VLOOKUP($E12,BaseAnual,R2,FALSE))","v":""},{"$f":"IF(AnACeS_base!$C12=\"\",\"\",VLOOKUP($E12,BaseAnual,S2,FALSE))","v":""},{"$f":"IF(AnACeS_base!$C12=\"\",\"\",VLOOKUP($E12,BaseAnual,T2,FALSE))","v":""},{"$f":"IF(AnACeS_base!$C12=\"\",\"\",VLOOKUP($E12,BaseAnual,U2,FALSE))","v":""},{"$f":"IF(AnACeS_base!$C12=\"\",\"\",VLOOKUP($E12,BaseAnual,V2,FALSE))","v":""},{"$f":"IF(AnACeS_base!$C12=\"\",\"\",VLOOKUP($E12,BaseAnual,$W$2,FALSE))","v":""},{"$f":"IF(AnACeS_base!$C12=\"\",\"\",VLOOKUP($E12,BaseAnual,$X$2,FALSE))","v":""},{"$f":"IF(AnACeS_base!$C12=\"\",\"\",VLOOKUP($E12,BaseAnual,$Y$2,FALSE))","v":""},{"$f":"IF(AnACeS_base!$C12=\"\",\"\",VLOOKUP($E12,BaseAnual,$Z$2,FALSE))","v":""}]
[null,null,null,null,null,23,24,25,26,27,28,29,30,31,32,33,34,35,36,37,38,39,40,41]
["Icod","Indicador","Rcod","Local_Residencia","cod_IndRes","96-98","97-99","98-00","99-01","00-02","01-03","02-04","03-05","04-06","05-07","06-08","07-09","08-10","09-11","10-12","11-13","12-14","13-15","14-16"]
["I04","Proporção de Nascimentos em Mulheres com Idade Inferior a 20 anos","R01","Continente","I04R01",{"$f":"IF(AnACeS_base!$C15=\"\",\"\",VLOOKUP($E15,BaseTrienal,F13,FALSE))","v":6.6005100623690121},{"$f":"IF(AnACeS_base!$C15=\"\",\"\",VLOOKUP($E15,BaseTrienal,G13,FALSE))","v":6.3397377665198098},{"$f":"IF(AnACeS_base!$C15=\"\",\"\",VLOOKUP($E15,BaseTrienal,H13,FALSE))","v":6.1570719392151858},{"$f":"IF(AnACeS_base!$C15=\"\",\"\",VLOOKUP($E15,BaseTrienal,I13,FALSE))","v":5.9997934248339799},{"$f":"IF(AnACeS_base!$C15=\"\",\"\",VLOOKUP($E15,BaseTrienal,J13,FALSE))","v":5.8386104412038211},{"$f":"IF(AnACeS_base!$C15=\"\",\"\",VLOOKUP($E15,BaseTrienal,K13,FALSE))","v":5.5742701065430982},{"$f":"IF(AnACeS_base!$C15=\"\",\"\",VLOOKUP($E15,BaseTrienal,L13,FALSE))","v":5.3239669785637629},{"$f":"IF(AnACeS_base!$C15=\"\",\"\",VLOOKUP($E15,BaseTrienal,M13,FALSE))","v":5.0479133182728839},{"$f":"IF(AnACeS_base!$C15=\"\",\"\",VLOOKUP($E15,BaseTrienal,N13,FALSE))","v":4.7920976889590854},{"$f":"IF(AnACeS_base!$C15=\"\",\"\",VLOOKUP($E15,BaseTrienal,O13,FALSE))","v":4.5957781495577521},{"$f":"IF(AnACeS_base!$C15=\"\",\"\",VLOOKUP($E15,BaseTrienal,P13,FALSE))","v":4.3757926241566478},{"$f":"IF(AnACeS_base!$C15=\"\",\"\",VLOOKUP($E15,BaseTrienal,Q13,FALSE))","v":4.2810000482249766},{"$f":"IF(AnACeS_base!$C15=\"\",\"\",VLOOKUP($E15,BaseTrienal,R13,FALSE))","v":4.0706148925440573},{"$f":"IF(AnACeS_base!$C15=\"\",\"\",VLOOKUP($E15,BaseTrienal,S13,FALSE))","v":3.8928681549633715},{"$f":"IF(AnACeS_base!$C15=\"\",\"\",VLOOKUP($E15,BaseTrienal,T13,FALSE))","v":3.700679873617462},{"$f":"IF(AnACeS_base!$C15=\"\",\"\",VLOOKUP($E15,BaseTrienal,U13,FALSE))","v":3.5088337010781969},{"$f":"IF(AnACeS_base!$C15=\"\",\"\",VLOOKUP($E15,BaseTrienal,V13,FALSE))","v":3.2697007728383647},{"$f":"IF(AnACeS_base!$C15=\"\",\"\",VLOOKUP($E15,BaseTrienal,W13,FALSE))","v":2.9314470425255026},{"$f":"IF(AnACeS_base!$C15=\"\",\"\",VLOOKUP($E15,BaseTrienal,X13,FALSE))","v":2.6462332394923518}]
["I04","Proporção de Nascimentos em Mulheres com Idade Inferior a 20 anos","R02","Região Alentejo","I04R02",{"$f":"IF(AnACeS_base!$C16=\"\",\"\",VLOOKUP($E16,BaseTrienal,F13,FALSE))","v":10.343319483927401},{"$f":"IF(AnACeS_base!$C16=\"\",\"\",VLOOKUP($E16,BaseTrienal,G13,FALSE))","v":9.6403596403596392},{"$f":"IF(AnACeS_base!$C16=\"\",\"\",VLOOKUP($E16,BaseTrienal,H13,FALSE))","v":9.0233019335646993},{"$f":"IF(AnACeS_base!$C16=\"\",\"\",VLOOKUP($E16,BaseTrienal,I13,FALSE))","v":8.841529267765857},{"$f":"IF(AnACeS_base!$C16=\"\",\"\",VLOOKUP($E16,BaseTrienal,J13,FALSE))","v":8.6364959254947617},{"$f":"IF(AnACeS_base!$C16=\"\",\"\",VLOOKUP($E16,BaseTrienal,K13,FALSE))","v":8.3314900833149004},{"$f":"IF(AnACeS_base!$C16=\"\",\"\",VLOOKUP($E16,BaseTrienal,L13,FALSE))","v":7.8632852353884273},{"$f":"IF(AnACeS_base!$C16=\"\",\"\",VLOOKUP($E16,BaseTrienal,M13,FALSE))","v":7.2260048319789147},{"$f":"IF(AnACeS_base!$C16=\"\",\"\",VLOOKUP($E16,BaseTrienal,N13,FALSE))","v":6.7000911577028255},{"$f":"IF(AnACeS_base!$C16=\"\",\"\",VLOOKUP($E16,BaseTrienal,O13,FALSE))","v":6.4223829584293775},{"$f":"IF(AnACeS_base!$C16=\"\",\"\",VLOOKUP($E16,BaseTrienal,P13,FALSE))","v":5.9809585808446579},{"$f":"IF(AnACeS_base!$C16=\"\",\"\",VLOOKUP($E16,BaseTrienal,Q13,FALSE))","v":5.6441717791411046},{"$f":"IF(AnACeS_base!$C16=\"\",\"\",VLOOKUP($E16,BaseTrienal,R13,FALSE))","v":5.343141217363188},{"$f":"IF(AnACeS_base!$C16=\"\",\"\",VLOOKUP($E16,BaseTrienal,S13,FALSE))","v":5.3613623400961457},{"$f":"IF(AnACeS_base!$C16=\"\",\"\",VLOOKUP($E16,BaseTrienal,T13,FALSE))","v":5.3072625698324023},{"$f":"IF(AnACeS_base!$C16=\"\",\"\",VLOOKUP($E16,BaseTrienal,U13,FALSE))","v":5.1388528419413442},{"$f":"IF(AnACeS_base!$C16=\"\",\"\",VLOOKUP($E16,BaseTrienal,V13,FALSE))","v":5.0708632431437515},{"$f":"IF(AnACeS_base!$C16=\"\",\"\",VLOOKUP($E16,BaseTrienal,W13,FALSE))","v":4.7908168105492841},{"$f":"IF(AnACeS_base!$C16=\"\",\"\",VLOOKUP($E16,BaseTrienal,X13,FALSE))","v":4.5088113985751779}]
["I04","Proporção de Nascimentos em Mulheres com Idade Inferior a 20 anos",{"$f":"IF(AnACeS_Select=1,\"\",VLOOKUP(AnACeS_Select,AnACeS_tab,2,FALSE))","v":""},{"$f":"IF(AnACeS_Select=1,\"\",VLOOKUP(AnACeS_Select,AnACeS_tab,3,FALSE))","v":""},{"$f":"IF(C17=\"\",\"\",CONCATENATE(A17,C17))","v":""},{"$f":"IF(AnACeS_base!$C17=\"\",\"\",VLOOKUP($E17,BaseTrienal,F13,FALSE))","v":""},{"$f":"IF(AnACeS_base!$C17=\"\",\"\",VLOOKUP($E17,BaseTrienal,G13,FALSE))","v":""},{"$f":"IF(AnACeS_base!$C17=\"\",\"\",VLOOKUP($E17,BaseTrienal,H13,FALSE))","v":""},{"$f":"IF(AnACeS_base!$C17=\"\",\"\",VLOOKUP($E17,BaseTrienal,I13,FALSE))","v":""},{"$f":"IF(AnACeS_base!$C17=\"\",\"\",VLOOKUP($E17,BaseTrienal,J13,FALSE))","v":""},{"$f":"IF(AnACeS_base!$C17=\"\",\"\",VLOOKUP($E17,BaseTrienal,K13,FALSE))","v":""},{"$f":"IF(AnACeS_base!$C17=\"\",\"\",VLOOKUP($E17,BaseTrienal,L13,FALSE))","v":""},{"$f":"IF(AnACeS_base!$C17=\"\",\"\",VLOOKUP($E17,BaseTrienal,M13,FALSE))","v":""},{"$f":"IF(AnACeS_base!$C17=\"\",\"\",VLOOKUP($E17,BaseTrienal,N13,FALSE))","v":""},{"$f":"IF(AnACeS_base!$C17=\"\",\"\",VLOOKUP($E17,BaseTrienal,O13,FALSE))","v":""},{"$f":"IF(AnACeS_base!$C17=\"\",\"\",VLOOKUP($E17,BaseTrienal,P13,FALSE))","v":""},{"$f":"IF(AnACeS_base!$C17=\"\",\"\",VLOOKUP($E17,BaseTrienal,Q13,FALSE))","v":""},{"$f":"IF(AnACeS_base!$C17=\"\",\"\",VLOOKUP($E17,BaseTrienal,R13,FALSE))","v":""},{"$f":"IF(AnACeS_base!$C17=\"\",\"\",VLOOKUP($E17,BaseTrienal,S13,FALSE))","v":""},{"$f":"IF(AnACeS_base!$C17=\"\",\"\",VLOOKUP($E17,BaseTrienal,T13,FALSE))","v":""},{"$f":"IF(AnACeS_base!$C17=\"\",\"\",VLOOKUP($E17,BaseTrienal,$U$13,FALSE))","v":""},{"$f":"IF(AnACeS_base!$C17=\"\",\"\",VLOOKUP($E17,BaseTrienal,$V$13,FALSE))","v":""},{"$f":"IF(AnACeS_base!$C17=\"\",\"\",VLOOKUP($E17,BaseTrienal,$W$13,FALSE))","v":""},{"$f":"IF(AnACeS_base!$C17=\"\",\"\",VLOOKUP($E17,BaseTrienal,$X$13,FALSE))","v":""}]
["I06","Proporção de Nascimentos em Mulheres com Idade igual ou superior a 35 anos","R01","Continente","I06R01",{"$f":"IF(AnACeS_base!$C18=\"\",\"\",VLOOKUP($E18,BaseTrienal,F13,FALSE))","v":11.02852056662374},{"$f":"IF(AnACeS_base!$C18=\"\",\"\",VLOOKUP($E18,BaseTrienal,G13,FALSE))","v":11.798646356852082},{"$f":"IF(AnACeS_base!$C18=\"\",\"\",VLOOKUP($E18,BaseTrienal,H13,FALSE))","v":12.542026241367173},{"$f":"IF(AnACeS_base!$C18=\"\",\"\",VLOOKUP($E18,BaseTrienal,I13,FALSE))","v":13.286124832157679},{"$f":"IF(AnACeS_base!$C18=\"\",\"\",VLOOKUP($E18,BaseTrienal,J13,FALSE))","v":13.845586284905897},{"$f":"IF(AnACeS_base!$C18=\"\",\"\",VLOOKUP($E18,BaseTrienal,K13,FALSE))","v":14.458886330137144},{"$f":"IF(AnACeS_base!$C18=\"\",\"\",VLOOKUP($E18,BaseTrienal,L13,FALSE))","v":15.038412755363781},{"$f":"IF(AnACeS_base!$C18=\"\",\"\",VLOOKUP($E18,BaseTrienal,M13,FALSE))","v":15.711222804119362},{"$f":"IF(AnACeS_base!$C18=\"\",\"\",VLOOKUP($E18,BaseTrienal,N13,FALSE))","v":16.519276078344351},{"$f":"IF(AnACeS_base!$C18=\"\",\"\",VLOOKUP($E18,BaseTrienal,O13,FALSE))","v":17.424297969059317},{"$f":"IF(AnACeS_base!$C18=\"\",\"\",VLOOKUP($E18,BaseTrienal,P13,FALSE))","v":18.401393327584167},{"$f":"IF(AnACeS_base!$C18=\"\",\"\",VLOOKUP($E18,BaseTrienal,Q13,FALSE))","v":19.432598706192774},{"$f":"IF(AnACeS_base!$C18=\"\",\"\",VLOOKUP($E18,BaseTrienal,R13,FALSE))","v":20.605566570183136},{"$f":"IF(AnACeS_base!$C18=\"\",\"\",VLOOKUP($E18,BaseTrienal,S13,FALSE))","v":22.210329710055042},{"$f":"IF(AnACeS_base!$C18=\"\",\"\",VLOOKUP($E18,BaseTrienal,T13,FALSE))","v":23.649863256437197},{"$f":"IF(AnACeS_base!$C18=\"\",\"\",VLOOKUP($E18,BaseTrienal,U13,FALSE))","v":25.160399355272833},{"$f":"IF(AnACeS_base!$C18=\"\",\"\",VLOOKUP($E18,BaseTrienal,V13,FALSE))","v":26.669529030979589},{"$f":"IF(AnACeS_base!$C18=\"\",\"\",VLOOKUP($E18,BaseTrienal,W13,FALSE))","v":28.317870786281013},{"$f":"IF(AnACeS_base!$C18=\"\",\"\",VLOOKUP($E18,BaseTrienal,X13,FALSE))","v":30.032274153061099}]
["I06","Proporção de Nascimentos em Mulheres com Idade igual ou superior a 35 anos","R02","Região Alentejo","I06R02",{"$f":"IF(AnACeS_base!$C19=\"\",\"\",VLOOKUP($E19,BaseTrienal,F13,FALSE))","v":9.8039215686274517},{"$f":"IF(AnACeS_base!$C19=\"\",\"\",VLOOKUP($E19,BaseTrienal,G13,FALSE))","v":10.468103325246183},{"$f":"IF(AnACeS_base!$C19=\"\",\"\",VLOOKUP($E19,BaseTrienal,H13,FALSE))","v":11.43848714498194},{"$f":"IF(AnACeS_base!$C19=\"\",\"\",VLOOKUP($E19,BaseTrienal,I13,FALSE))","v":12.369501043991649},{"$f":"IF(AnACeS_base!$C19=\"\",\"\",VLOOKUP($E19,BaseTrienal,J13,FALSE))","v":12.645518044237486},{"$f":"IF(AnACeS_base!$C19=\"\",\"\",VLOOKUP($E19,BaseTrienal,K13,FALSE))","v":13.013345130133452},{"$f":"IF(AnACeS_base!$C19=\"\",\"\",VLOOKUP($E19,BaseTrienal,L13,FALSE))","v":13.489287275907301},{"$f":"IF(AnACeS_base!$C19=\"\",\"\",VLOOKUP($E19,BaseTrienal,M13,FALSE))","v":14.276301339775971},{"$f":"IF(AnACeS_base!$C19=\"\",\"\",VLOOKUP($E19,BaseTrienal,N13,FALSE))","v":14.896687936797326},{"$f":"IF(AnACeS_base!$C19=\"\",\"\",VLOOKUP($E19,BaseTrienal,O13,FALSE))","v":15.332644463874095},{"$f":"IF(AnACeS_base!$C19=\"\",\"\",VLOOKUP($E19,BaseTrienal,P13,FALSE))","v":16.429327040442672},{"$f":"IF(AnACeS_base!$C19=\"\",\"\",VLOOKUP($E19,BaseTrienal,Q13,FALSE))","v":17.267893660531698},{"$f":"IF(AnACeS_base!$C19=\"\",\"\",VLOOKUP($E19,BaseTrienal,R13,FALSE))","v":18.462533344111229},{"$f":"IF(AnACeS_base!$C19=\"\",\"\",VLOOKUP($E19,BaseTrienal,S13,FALSE))","v":19.620304733968872},{"$f":"IF(AnACeS_base!$C19=\"\",\"\",VLOOKUP($E19,BaseTrienal,T13,FALSE))","v":21.031876437725927},{"$f":"IF(AnACeS_base!$C19=\"\",\"\",VLOOKUP($E19,BaseTrienal,U13,FALSE))","v":22.372177524007267},{"$f":"IF(AnACeS_base!$C19=\"\",\"\",VLOOKUP($E19,BaseTrienal,V13,FALSE))","v":23.246824958586416},{"$f":"IF(AnACeS_base!$C19=\"\",\"\",VLOOKUP($E19,BaseTrienal,W13,FALSE))","v":24.504316478512475},{"$f":"IF(AnACeS_base!$C19=\"\",\"\",VLOOKUP($E19,BaseTrienal,X13,FALSE))","v":26.321709786276713}]
["I06","Proporção de Nascimentos em Mulheres com Idade igual ou superior a 35 anos",{"$f":"IF(AnACeS_Select=1,\"\",VLOOKUP(AnACeS_Select,AnACeS_tab,2,FALSE))","v":""},{"$f":"IF(AnACeS_Select=1,\"\",VLOOKUP(AnACeS_Select,AnACeS_tab,3,FALSE))","v":""},{"$f":"IF(C20=\"\",\"\",CONCATENATE(A20,C20))","v":""},{"$f":"IF(AnACeS_base!$C20=\"\",\"\",VLOOKUP($E20,BaseTrienal,F13,FALSE))","v":""},{"$f":"IF(AnACeS_base!$C20=\"\",\"\",VLOOKUP($E20,BaseTrienal,G13,FALSE))","v":""},{"$f":"IF(AnACeS_base!$C20=\"\",\"\",VLOOKUP($E20,BaseTrienal,H13,FALSE))","v":""},{"$f":"IF(AnACeS_base!$C20=\"\",\"\",VLOOKUP($E20,BaseTrienal,I13,FALSE))","v":""},{"$f":"IF(AnACeS_base!$C20=\"\",\"\",VLOOKUP($E20,BaseTrienal,J13,FALSE))","v":""},{"$f":"IF(AnACeS_base!$C20=\"\",\"\",VLOOKUP($E20,BaseTrienal,K13,FALSE))","v":""},{"$f":"IF(AnACeS_base!$C20=\"\",\"\",VLOOKUP($E20,BaseTrienal,L13,FALSE))","v":""},{"$f":"IF(AnACeS_base!$C20=\"\",\"\",VLOOKUP($E20,BaseTrienal,M13,FALSE))","v":""},{"$f":"IF(AnACeS_base!$C20=\"\",\"\",VLOOKUP($E20,BaseTrienal,N13,FALSE))","v":""},{"$f":"IF(AnACeS_base!$C20=\"\",\"\",VLOOKUP($E20,BaseTrienal,O13,FALSE))","v":""},{"$f":"IF(AnACeS_base!$C20=\"\",\"\",VLOOKUP($E20,BaseTrienal,P13,FALSE))","v":""},{"$f":"IF(AnACeS_base!$C20=\"\",\"\",VLOOKUP($E20,BaseTrienal,Q13,FALSE))","v":""},{"$f":"IF(AnACeS_base!$C20=\"\",\"\",VLOOKUP($E20,BaseTrienal,R13,FALSE))","v":""},{"$f":"IF(AnACeS_base!$C20=\"\",\"\",VLOOKUP($E20,BaseTrienal,S13,FALSE))","v":""},{"$f":"IF(AnACeS_base!$C20=\"\",\"\",VLOOKUP($E20,BaseTrienal,T13,FALSE))","v":""},{"$f":"IF(AnACeS_base!$C20=\"\",\"\",VLOOKUP($E20,BaseTrienal,$U$13,FALSE))","v":""},{"$f":"IF(AnACeS_base!$C20=\"\",\"\",VLOOKUP($E20,BaseTrienal,$V$13,FALSE))","v":""},{"$f":"IF(AnACeS_base!$C20=\"\",\"\",VLOOKUP($E20,BaseTrienal,$W$13,FALSE))","v":""},{"$f":"IF(AnACeS_base!$C20=\"\",\"\",VLOOKUP($E20,BaseTrienal,$X$13,FALSE))","v":""}]
["I08","Proporção nascimentos pré-termo","R01","Continente","I08R01","na","na","na","na",{"$f":"IF(AnACeS_base!$C21=\"\",\"\",VLOOKUP($E21,BaseTrienal,J13,FALSE))","v":6.027031394345542},{"$f":"IF(AnACeS_base!$C21=\"\",\"\",VLOOKUP($E21,BaseTrienal,K13,FALSE))","v":6.3536333409161028},{"$f":"IF(AnACeS_base!$C21=\"\",\"\",VLOOKUP($E21,BaseTrienal,L13,FALSE))","v":6.7345853279325727},{"$f":"IF(AnACeS_base!$C21=\"\",\"\",VLOOKUP($E21,BaseTrienal,M13,FALSE))","v":6.7775217998408746},{"$f":"IF(AnACeS_base!$C21=\"\",\"\",VLOOKUP($E21,BaseTrienal,N13,FALSE))","v":7.1021596256387838},{"$f":"IF(AnACeS_base!$C21=\"\",\"\",VLOOKUP($E21,BaseTrienal,O13,FALSE))","v":7.8368182151450725},{"$f":"IF(AnACeS_base!$C21=\"\",\"\",VLOOKUP($E21,BaseTrienal,P13,FALSE))","v":8.6653477400700041},{"$f":"IF(AnACeS_base!$C21=\"\",\"\",VLOOKUP($E21,BaseTrienal,Q13,FALSE))","v":8.9602006159018419},{"$f":"IF(AnACeS_base!$C21=\"\",\"\",VLOOKUP($E21,BaseTrienal,R13,FALSE))","v":8.5187590237432396},{"$f":"IF(AnACeS_base!$C21=\"\",\"\",VLOOKUP($E21,BaseTrienal,S13,FALSE))","v":8.0207118731769906},{"$f":"IF(AnACeS_base!$C21=\"\",\"\",VLOOKUP($E21,BaseTrienal,T13,FALSE))","v":7.6957153683655575},{"$f":"IF(AnACeS_base!$C21=\"\",\"\",VLOOKUP($E21,BaseTrienal,U13,FALSE))","v":7.7433766802810515},{"$f":"IF(AnACeS_base!$C21=\"\",\"\",VLOOKUP($E21,BaseTrienal,V13,FALSE))","v":7.8514102648787905},{"$f":"IF(AnACeS_base!$C21=\"\",\"\",VLOOKUP($E21,BaseTrienal,W13,FALSE))","v":7.9173838209982792},{"$f":"IF(AnACeS_base!$C21=\"\",\"\",VLOOKUP($E21,BaseTrienal,X13,FALSE))","v":7.8974811321921283}]
["I08","Proporção nascimentos pré-termo","R02","Região Alentejo","I08R02","na","na","na","na",{"$f":"IF(AnACeS_base!$C22=\"\",\"\",VLOOKUP($E22,BaseTrienal,J13,FALSE))","v":6.257275902211874},{"$f":"IF(AnACeS_base!$C22=\"\",\"\",VLOOKUP($E22,BaseTrienal,K13,FALSE))","v":6.4366290643662909},{"$f":"IF(AnACeS_base!$C22=\"\",\"\",VLOOKUP($E22,BaseTrienal,L13,FALSE))","v":6.7118495846086574},{"$f":"IF(AnACeS_base!$C22=\"\",\"\",VLOOKUP($E22,BaseTrienal,M13,FALSE))","v":6.8526246430924669},{"$f":"IF(AnACeS_base!$C22=\"\",\"\",VLOOKUP($E22,BaseTrienal,N13,FALSE))","v":7.0723184442418718},{"$f":"IF(AnACeS_base!$C22=\"\",\"\",VLOOKUP($E22,BaseTrienal,O13,FALSE))","v":8.1154121294014772},{"$f":"IF(AnACeS_base!$C22=\"\",\"\",VLOOKUP($E22,BaseTrienal,P13,FALSE))","v":8.5686386199039788},{"$f":"IF(AnACeS_base!$C22=\"\",\"\",VLOOKUP($E22,BaseTrienal,Q13,FALSE))","v":8.8016359918200404},{"$f":"IF(AnACeS_base!$C22=\"\",\"\",VLOOKUP($E22,BaseTrienal,R13,FALSE))","v":8.1157545873413639},{"$f":"IF(AnACeS_base!$C22=\"\",\"\",VLOOKUP($E22,BaseTrienal,S13,FALSE))","v":7.463537847307097},{"$f":"IF(AnACeS_base!$C22=\"\",\"\",VLOOKUP($E22,BaseTrienal,T13,FALSE))","v":7.0900427209990138},{"$f":"IF(AnACeS_base!$C22=\"\",\"\",VLOOKUP($E22,BaseTrienal,U13,FALSE))","v":6.9469677307725588},{"$f":"IF(AnACeS_base!$C22=\"\",\"\",VLOOKUP($E22,BaseTrienal,V13,FALSE))","v":7.0863243143751156},{"$f":"IF(AnACeS_base!$C22=\"\",\"\",VLOOKUP($E22,BaseTrienal,W13,FALSE))","v":7.2953230243809886},{"$f":"IF(AnACeS_base!$C22=\"\",\"\",VLOOKUP($E22,BaseTrienal,X13,FALSE))","v":7.2928383952006}]
["I08","Proporção nascimentos pré-termo",{"$f":"IF(AnACeS_Select=1,\"\",VLOOKUP(AnACeS_Select,AnACeS_tab,2,FALSE))","v":""},{"$f":"IF(AnACeS_Select=1,\"\",VLOOKUP(AnACeS_Select,AnACeS_tab,3,FALSE))","v":""},{"$f":"IF(C23=\"\",\"\",CONCATENATE(A23,C23))","v":""},{"$f":"IF(AnACeS_base!$C23=\"\",\"\",VLOOKUP($E23,BaseTrienal,F13,FALSE))","v":""},{"$f":"IF(AnACeS_base!$C23=\"\",\"\",VLOOKUP($E23,BaseTrienal,G13,FALSE))","v":""},{"$f":"IF(AnACeS_base!$C23=\"\",\"\",VLOOKUP($E23,BaseTrienal,H13,FALSE))","v":""},{"$f":"IF(AnACeS_base!$C23=\"\",\"\",VLOOKUP($E23,BaseTrienal,I13,FALSE))","v":""},{"$f":"IF(AnACeS_base!$C23=\"\",\"\",VLOOKUP($E23,BaseTrienal,J13,FALSE))","v":""},{"$f":"IF(AnACeS_base!$C23=\"\",\"\",VLOOKUP($E23,BaseTrienal,K13,FALSE))","v":""},{"$f":"IF(AnACeS_base!$C23=\"\",\"\",VLOOKUP($E23,BaseTrienal,L13,FALSE))","v":""},{"$f":"IF(AnACeS_base!$C23=\"\",\"\",VLOOKUP($E23,BaseTrienal,M13,FALSE))","v":""},{"$f":"IF(AnACeS_base!$C23=\"\",\"\",VLOOKUP($E23,BaseTrienal,N13,FALSE))","v":""},{"$f":"IF(AnACeS_base!$C23=\"\",\"\",VLOOKUP($E23,BaseTrienal,O13,FALSE))","v":""},{"$f":"IF(AnACeS_base!$C23=\"\",\"\",VLOOKUP($E23,BaseTrienal,P13,FALSE))","v":""},{"$f":"IF(AnACeS_base!$C23=\"\",\"\",VLOOKUP($E23,BaseTrienal,Q13,FALSE))","v":""},{"$f":"IF(AnACeS_base!$C23=\"\",\"\",VLOOKUP($E23,BaseTrienal,R13,FALSE))","v":""},{"$f":"IF(AnACeS_base!$C23=\"\",\"\",VLOOKUP($E23,BaseTrienal,S13,FALSE))","v":""},{"$f":"IF(AnACeS_base!$C23=\"\",\"\",VLOOKUP($E23,BaseTrienal,T13,FALSE))","v":""},{"$f":"IF(AnACeS_base!$C23=\"\",\"\",VLOOKUP($E23,BaseTrienal,$U$13,FALSE))","v":""},{"$f":"IF(AnACeS_base!$C23=\"\",\"\",VLOOKUP($E23,BaseTrienal,$V$13,FALSE))","v":""},{"$f":"IF(AnACeS_base!$C23=\"\",\"\",VLOOKUP($E23,BaseTrienal,$W$13,FALSE))","v":""},{"$f":"IF(AnACeS_base!$C23=\"\",\"\",VLOOKUP($E23,BaseTrienal,$X$13,FALSE))","v":""}]
["I10","Proporção de Baixo Peso à Nascença","R01","Continente","I10R01",{"$f":"IF(AnACeS_base!$C24=\"\",\"\",VLOOKUP($E24,BaseTrienal,F13,FALSE))","v":6.524442592732874},{"$f":"IF(AnACeS_base!$C24=\"\",\"\",VLOOKUP($E24,BaseTrienal,G13,FALSE))","v":6.882311176702208},{"$f":"IF(AnACeS_base!$C24=\"\",\"\",VLOOKUP($E24,BaseTrienal,H13,FALSE))","v":7.071939215186493},{"$f":"IF(AnACeS_base!$C24=\"\",\"\",VLOOKUP($E24,BaseTrienal,I13,FALSE))","v":7.231042171712569},{"$f":"IF(AnACeS_base!$C24=\"\",\"\",VLOOKUP($E24,BaseTrienal,J13,FALSE))","v":7.1993268066916878},{"$f":"IF(AnACeS_base!$C24=\"\",\"\",VLOOKUP($E24,BaseTrienal,K13,FALSE))","v":7.3056344128911226},{"$f":"IF(AnACeS_base!$C24=\"\",\"\",VLOOKUP($E24,BaseTrienal,L13,FALSE))","v":7.4430417992465374},{"$f":"IF(AnACeS_base!$C24=\"\",\"\",VLOOKUP($E24,BaseTrienal,M13,FALSE))","v":7.5060470793485452},{"$f":"IF(AnACeS_base!$C24=\"\",\"\",VLOOKUP($E24,BaseTrienal,N13,FALSE))","v":7.5629319740766601},{"$f":"IF(AnACeS_base!$C24=\"\",\"\",VLOOKUP($E24,BaseTrienal,O13,FALSE))","v":7.6481880169833829},{"$f":"IF(AnACeS_base!$C24=\"\",\"\",VLOOKUP($E24,BaseTrienal,P13,FALSE))","v":7.7140296589391104},{"$f":"IF(AnACeS_base!$C24=\"\",\"\",VLOOKUP($E24,BaseTrienal,Q13,FALSE))","v":7.9181966614537762},{"$f":"IF(AnACeS_base!$C24=\"\",\"\",VLOOKUP($E24,BaseTrienal,R13,FALSE))","v":8.0821652838895535},{"$f":"IF(AnACeS_base!$C24=\"\",\"\",VLOOKUP($E24,BaseTrienal,S13,FALSE))","v":8.3258611340494841},{"$f":"IF(AnACeS_base!$C24=\"\",\"\",VLOOKUP($E24,BaseTrienal,T13,FALSE))","v":8.4403911561512643},{"$f":"IF(AnACeS_base!$C24=\"\",\"\",VLOOKUP($E24,BaseTrienal,U13,FALSE))","v":8.5551539051374732},{"$f":"IF(AnACeS_base!$C24=\"\",\"\",VLOOKUP($E24,BaseTrienal,V13,FALSE))","v":8.6671840940616942},{"$f":"IF(AnACeS_base!$C24=\"\",\"\",VLOOKUP($E24,BaseTrienal,W13,FALSE))","v":8.7876243650560433},{"$f":"IF(AnACeS_base!$C24=\"\",\"\",VLOOKUP($E24,BaseTrienal,X13,FALSE))","v":8.7618348865870601}]
["I10","Proporção de Baixo Peso à Nascença","R02","Região Alentejo","I10R02",{"$f":"IF(AnACeS_base!$C25=\"\",\"\",VLOOKUP($E25,BaseTrienal,F13,FALSE))","v":6.8372330344777312},{"$f":"IF(AnACeS_base!$C25=\"\",\"\",VLOOKUP($E25,BaseTrienal,G13,FALSE))","v":7.3212501783930346},{"$f":"IF(AnACeS_base!$C25=\"\",\"\",VLOOKUP($E25,BaseTrienal,H13,FALSE))","v":7.6138536723563996},{"$f":"IF(AnACeS_base!$C25=\"\",\"\",VLOOKUP($E25,BaseTrienal,I13,FALSE))","v":7.7687378500971986},{"$f":"IF(AnACeS_base!$C25=\"\",\"\",VLOOKUP($E25,BaseTrienal,J13,FALSE))","v":7.5305587892898718},{"$f":"IF(AnACeS_base!$C25=\"\",\"\",VLOOKUP($E25,BaseTrienal,K13,FALSE))","v":7.3582540735825406},{"$f":"IF(AnACeS_base!$C25=\"\",\"\",VLOOKUP($E25,BaseTrienal,L13,FALSE))","v":7.5353447019384925},{"$f":"IF(AnACeS_base!$C25=\"\",\"\",VLOOKUP($E25,BaseTrienal,M13,FALSE))","v":7.7018815433047809},{"$f":"IF(AnACeS_base!$C25=\"\",\"\",VLOOKUP($E25,BaseTrienal,N13,FALSE))","v":8.2117897295654814},{"$f":"IF(AnACeS_base!$C25=\"\",\"\",VLOOKUP($E25,BaseTrienal,O13,FALSE))","v":8.194897067005801},{"$f":"IF(AnACeS_base!$C25=\"\",\"\",VLOOKUP($E25,BaseTrienal,P13,FALSE))","v":8.5035397509968256},{"$f":"IF(AnACeS_base!$C25=\"\",\"\",VLOOKUP($E25,BaseTrienal,Q13,FALSE))","v":8.4335378323108383},{"$f":"IF(AnACeS_base!$C25=\"\",\"\",VLOOKUP($E25,BaseTrienal,R13,FALSE))","v":8.859429310484197},{"$f":"IF(AnACeS_base!$C25=\"\",\"\",VLOOKUP($E25,BaseTrienal,S13,FALSE))","v":8.8242483500366653},{"$f":"IF(AnACeS_base!$C25=\"\",\"\",VLOOKUP($E25,BaseTrienal,T13,FALSE))","v":8.7085113374958922},{"$f":"IF(AnACeS_base!$C25=\"\",\"\",VLOOKUP($E25,BaseTrienal,U13,FALSE))","v":8.5993598062116092},{"$f":"IF(AnACeS_base!$C25=\"\",\"\",VLOOKUP($E25,BaseTrienal,V13,FALSE))","v":8.5219952144303335},{"$f":"IF(AnACeS_base!$C25=\"\",\"\",VLOOKUP($E25,BaseTrienal,W13,FALSE))","v":8.8226923441798686},{"$f":"IF(AnACeS_base!$C25=\"\",\"\",VLOOKUP($E25,BaseTrienal,X13,FALSE))","v":8.8301462317210344}]
["I10","Proporção de Baixo Peso à Nascença",{"$f":"IF(AnACeS_Select=1,\"\",VLOOKUP(AnACeS_Select,AnACeS_tab,2,FALSE))","v":""},{"$f":"IF(AnACeS_Select=1,\"\",VLOOKUP(AnACeS_Select,AnACeS_tab,3,FALSE))","v":""},{"$f":"IF(C26=\"\",\"\",CONCATENATE(A26,C26))","v":""},{"$f":"IF(AnACeS_base!$C26=\"\",\"\",VLOOKUP($E26,BaseTrienal,F13,FALSE))","v":""},{"$f":"IF(AnACeS_base!$C26=\"\",\"\",VLOOKUP($E26,BaseTrienal,G13,FALSE))","v":""},{"$f":"IF(AnACeS_base!$C26=\"\",\"\",VLOOKUP($E26,BaseTrienal,H13,FALSE))","v":""},{"$f":"IF(AnACeS_base!$C26=\"\",\"\",VLOOKUP($E26,BaseTrienal,I13,FALSE))","v":""},{"$f":"IF(AnACeS_base!$C26=\"\",\"\",VLOOKUP($E26,BaseTrienal,J13,FALSE))","v":""},{"$f":"IF(AnACeS_base!$C26=\"\",\"\",VLOOKUP($E26,BaseTrienal,K13,FALSE))","v":""},{"$f":"IF(AnACeS_base!$C26=\"\",\"\",VLOOKUP($E26,BaseTrienal,L13,FALSE))","v":""},{"$f":"IF(AnACeS_base!$C26=\"\",\"\",VLOOKUP($E26,BaseTrienal,M13,FALSE))","v":""},{"$f":"IF(AnACeS_base!$C26=\"\",\"\",VLOOKUP($E26,BaseTrienal,N13,FALSE))","v":""},{"$f":"IF(AnACeS_base!$C26=\"\",\"\",VLOOKUP($E26,BaseTrienal,O13,FALSE))","v":""},{"$f":"IF(AnACeS_base!$C26=\"\",\"\",VLOOKUP($E26,BaseTrienal,P13,FALSE))","v":""},{"$f":"IF(AnACeS_base!$C26=\"\",\"\",VLOOKUP($E26,BaseTrienal,Q13,FALSE))","v":""},{"$f":"IF(AnACeS_base!$C26=\"\",\"\",VLOOKUP($E26,BaseTrienal,R13,FALSE))","v":""},{"$f":"IF(AnACeS_base!$C26=\"\",\"\",VLOOKUP($E26,BaseTrienal,S13,FALSE))","v":""},{"$f":"IF(AnACeS_base!$C26=\"\",\"\",VLOOKUP($E26,BaseTrienal,T13,FALSE))","v":""},{"$f":"IF(AnACeS_base!$C26=\"\",\"\",VLOOKUP($E26,BaseTrienal,$U$13,FALSE))","v":""},{"$f":"IF(AnACeS_base!$C26=\"\",\"\",VLOOKUP($E26,BaseTrienal,$V$13,FALSE))","v":""},{"$f":"IF(AnACeS_base!$C26=\"\",\"\",VLOOKUP($E26,BaseTrienal,$W$13,FALSE))","v":""},{"$f":"IF(AnACeS_base!$C26=\"\",\"\",VLOOKUP($E26,BaseTrienal,$X$13,FALSE))","v":""}]
["I15","Taxa de Mortalidade Infantil","R01","Continente","I15R01",{"$f":"IF(AnACeS_base!$C27=\"\",\"\",VLOOKUP($E27,BaseTrienal,F13,FALSE))","v":6.2211196121505949},{"$f":"IF(AnACeS_base!$C27=\"\",\"\",VLOOKUP($E27,BaseTrienal,G13,FALSE))","v":5.8287886351023293},{"$f":"IF(AnACeS_base!$C27=\"\",\"\",VLOOKUP($E27,BaseTrienal,H13,FALSE))","v":5.5013411984609597},{"$f":"IF(AnACeS_base!$C27=\"\",\"\",VLOOKUP($E27,BaseTrienal,I13,FALSE))","v":5.173492760755579},{"$f":"IF(AnACeS_base!$C27=\"\",\"\",VLOOKUP($E27,BaseTrienal,J13,FALSE))","v":5.0154121022351354},{"$f":"IF(AnACeS_base!$C27=\"\",\"\",VLOOKUP($E27,BaseTrienal,K13,FALSE))","v":4.6119855532668748},{"$f":"IF(AnACeS_base!$C27=\"\",\"\",VLOOKUP($E27,BaseTrienal,L13,FALSE))","v":4.261439636424293},{"$f":"IF(AnACeS_base!$C27=\"\",\"\",VLOOKUP($E27,BaseTrienal,M13,FALSE))","v":3.7480708458881455},{"$f":"IF(AnACeS_base!$C27=\"\",\"\",VLOOKUP($E27,BaseTrienal,N13,FALSE))","v":3.4818986953485491},{"$f":"IF(AnACeS_base!$C27=\"\",\"\",VLOOKUP($E27,BaseTrienal,O13,FALSE))","v":3.3593505255650573},{"$f":"IF(AnACeS_base!$C27=\"\",\"\",VLOOKUP($E27,BaseTrienal,P13,FALSE))","v":3.3108439439287105},{"$f":"IF(AnACeS_base!$C27=\"\",\"\",VLOOKUP($E27,BaseTrienal,Q13,FALSE))","v":3.4136394011835787},{"$f":"IF(AnACeS_base!$C27=\"\",\"\",VLOOKUP($E27,BaseTrienal,R13,FALSE))","v":3.1017498290238121},{"$f":"IF(AnACeS_base!$C27=\"\",\"\",VLOOKUP($E27,BaseTrienal,S13,FALSE))","v":3.0444043564398542},{"$f":"IF(AnACeS_base!$C27=\"\",\"\",VLOOKUP($E27,BaseTrienal,T13,FALSE))","v":2.9435562113063312},{"$f":"IF(AnACeS_base!$C27=\"\",\"\",VLOOKUP($E27,BaseTrienal,U13,FALSE))","v":3.1062704411373487},{"$f":"IF(AnACeS_base!$C27=\"\",\"\",VLOOKUP($E27,BaseTrienal,V13,FALSE))","v":2.9889688883017369},{"$f":"IF(AnACeS_base!$C27=\"\",\"\",VLOOKUP($E27,BaseTrienal,W13,FALSE))","v":2.8294362117459384},{"$f":"IF(AnACeS_base!$C27=\"\",\"\",VLOOKUP($E27,BaseTrienal,X13,FALSE))","v":2.9553726366293085}]
["I15","Taxa de Mortalidade Infantil","R02","Região Alentejo","I15R02",{"$f":"IF(AnACeS_base!$C28=\"\",\"\",VLOOKUP($E28,BaseTrienal,F13,FALSE))","v":4.9566294919454768},{"$f":"IF(AnACeS_base!$C28=\"\",\"\",VLOOKUP($E28,BaseTrienal,G13,FALSE))","v":4.5668617097188529},{"$f":"IF(AnACeS_base!$C28=\"\",\"\",VLOOKUP($E28,BaseTrienal,H13,FALSE))","v":4.6037254763085205},{"$f":"IF(AnACeS_base!$C28=\"\",\"\",VLOOKUP($E28,BaseTrienal,I13,FALSE))","v":4.3199654402764782},{"$f":"IF(AnACeS_base!$C28=\"\",\"\",VLOOKUP($E28,BaseTrienal,J13,FALSE))","v":4.583818393480791},{"$f":"IF(AnACeS_base!$C28=\"\",\"\",VLOOKUP($E28,BaseTrienal,K13,FALSE))","v":4.6449900464498999},{"$f":"IF(AnACeS_base!$C28=\"\",\"\",VLOOKUP($E28,BaseTrienal,L13,FALSE))","v":4.8826701646990234},{"$f":"IF(AnACeS_base!$C28=\"\",\"\",VLOOKUP($E28,BaseTrienal,M13,FALSE))","v":4.4659199062888932},{"$f":"IF(AnACeS_base!$C28=\"\",\"\",VLOOKUP($E28,BaseTrienal,N13,FALSE))","v":3.7982376177453658},{"$f":"IF(AnACeS_base!$C28=\"\",\"\",VLOOKUP($E28,BaseTrienal,O13,FALSE))","v":3.6563071297989032},{"$f":"IF(AnACeS_base!$C28=\"\",\"\",VLOOKUP($E28,BaseTrienal,P13,FALSE))","v":3.8245585482952236},{"$f":"IF(AnACeS_base!$C28=\"\",\"\",VLOOKUP($E28,BaseTrienal,Q13,FALSE))","v":4.6625766871165641},{"$f":"IF(AnACeS_base!$C28=\"\",\"\",VLOOKUP($E28,BaseTrienal,R13,FALSE))","v":4.0417104518632287},{"$f":"IF(AnACeS_base!$C28=\"\",\"\",VLOOKUP($E28,BaseTrienal,S13,FALSE))","v":3.3406665037073249},{"$f":"IF(AnACeS_base!$C28=\"\",\"\",VLOOKUP($E28,BaseTrienal,T13,FALSE))","v":2.6289845547157413},{"$f":"IF(AnACeS_base!$C28=\"\",\"\",VLOOKUP($E28,BaseTrienal,U13,FALSE))","v":2.8549182455229691},{"$f":"IF(AnACeS_base!$C28=\"\",\"\",VLOOKUP($E28,BaseTrienal,V13,FALSE))","v":3.0369961347321923},{"$f":"IF(AnACeS_base!$C28=\"\",\"\",VLOOKUP($E28,BaseTrienal,W13,FALSE))","v":3.0357651076747936},{"$f":"IF(AnACeS_base!$C28=\"\",\"\",VLOOKUP($E28,BaseTrienal,X13,FALSE))","v":2.5309336332958381}]
["I15","Taxa de Mortalidade Infantil",{"$f":"IF(AnACeS_Select=1,\"\",VLOOKUP(AnACeS_Select,AnACeS_tab,2,FALSE))","v":""},{"$f":"IF(AnACeS_Select=1,\"\",VLOOKUP(AnACeS_Select,AnACeS_tab,3,FALSE))","v":""},{"$f":"IF(C29=\"\",\"\",CONCATENATE(A29,C29))","v":""},{"$f":"IF(AnACeS_base!$C29=\"\",\"\",VLOOKUP($E29,BaseTrienal,F13,FALSE))","v":""},{"$f":"IF(AnACeS_base!$C29=\"\",\"\",VLOOKUP($E29,BaseTrienal,G13,FALSE))","v":""},{"$f":"IF(AnACeS_base!$C29=\"\",\"\",VLOOKUP($E29,BaseTrienal,H13,FALSE))","v":""},{"$f":"IF(AnACeS_base!$C29=\"\",\"\",VLOOKUP($E29,BaseTrienal,I13,FALSE))","v":""},{"$f":"IF(AnACeS_base!$C29=\"\",\"\",VLOOKUP($E29,BaseTrienal,J13,FALSE))","v":""},{"$f":"IF(AnACeS_base!$C29=\"\",\"\",VLOOKUP($E29,BaseTrienal,K13,FALSE))","v":""},{"$f":"IF(AnACeS_base!$C29=\"\",\"\",VLOOKUP($E29,BaseTrienal,L13,FALSE))","v":""},{"$f":"IF(AnACeS_base!$C29=\"\",\"\",VLOOKUP($E29,BaseTrienal,M13,FALSE))","v":""},{"$f":"IF(AnACeS_base!$C29=\"\",\"\",VLOOKUP($E29,BaseTrienal,N13,FALSE))","v":""},{"$f":"IF(AnACeS_base!$C29=\"\",\"\",VLOOKUP($E29,BaseTrienal,O13,FALSE))","v":""},{"$f":"IF(AnACeS_base!$C29=\"\",\"\",VLOOKUP($E29,BaseTrienal,P13,FALSE))","v":""},{"$f":"IF(AnACeS_base!$C29=\"\",\"\",VLOOKUP($E29,BaseTrienal,Q13,FALSE))","v":""},{"$f":"IF(AnACeS_base!$C29=\"\",\"\",VLOOKUP($E29,BaseTrienal,R13,FALSE))","v":""},{"$f":"IF(AnACeS_base!$C29=\"\",\"\",VLOOKUP($E29,BaseTrienal,S13,FALSE))","v":""},{"$f":"IF(AnACeS_base!$C29=\"\",\"\",VLOOKUP($E29,BaseTrienal,T13,FALSE))","v":""},{"$f":"IF(AnACeS_base!$C29=\"\",\"\",VLOOKUP($E29,BaseTrienal,$U$13,FALSE))","v":""},{"$f":"IF(AnACeS_base!$C29=\"\",\"\",VLOOKUP($E29,BaseTrienal,$V$13,FALSE))","v":""},{"$f":"IF(AnACeS_base!$C29=\"\",\"\",VLOOKUP($E29,BaseTrienal,$W$13,FALSE))","v":""},{"$f":"IF(AnACeS_base!$C29=\"\",\"\",VLOOKUP($E29,BaseTrienal,$X$13,FALSE))","v":""}]
["I17","Taxa de Mortalidade Neonatal","R01","Continente","I17R01",{"$f":"IF(AnACeS_base!$C30=\"\",\"\",VLOOKUP($E30,BaseTrienal,F13,FALSE))","v":3.8759689922480618},{"$f":"IF(AnACeS_base!$C30=\"\",\"\",VLOOKUP($E30,BaseTrienal,G13,FALSE))","v":3.695700028213817},{"$f":"IF(AnACeS_base!$C30=\"\",\"\",VLOOKUP($E30,BaseTrienal,H13,FALSE))","v":3.4440277221473741},{"$f":"IF(AnACeS_base!$C30=\"\",\"\",VLOOKUP($E30,BaseTrienal,I13,FALSE))","v":3.1776121125956172},{"$f":"IF(AnACeS_base!$C30=\"\",\"\",VLOOKUP($E30,BaseTrienal,J13,FALSE))","v":3.1433981017656079},{"$f":"IF(AnACeS_base!$C30=\"\",\"\",VLOOKUP($E30,BaseTrienal,K13,FALSE))","v":2.9416988934350878},{"$f":"IF(AnACeS_base!$C30=\"\",\"\",VLOOKUP($E30,BaseTrienal,L13,FALSE))","v":2.8325669666040354},{"$f":"IF(AnACeS_base!$C30=\"\",\"\",VLOOKUP($E30,BaseTrienal,M13,FALSE))","v":2.4252223120452712},{"$f":"IF(AnACeS_base!$C30=\"\",\"\",VLOOKUP($E30,BaseTrienal,N13,FALSE))","v":2.2483863178023902},{"$f":"IF(AnACeS_base!$C30=\"\",\"\",VLOOKUP($E30,BaseTrienal,O13,FALSE))","v":2.1029267674916183},{"$f":"IF(AnACeS_base!$C30=\"\",\"\",VLOOKUP($E30,BaseTrienal,P13,FALSE))","v":2.0798457870440825},{"$f":"IF(AnACeS_base!$C30=\"\",\"\",VLOOKUP($E30,BaseTrienal,Q13,FALSE))","v":2.177013220532817},{"$f":"IF(AnACeS_base!$C30=\"\",\"\",VLOOKUP($E30,BaseTrienal,R13,FALSE))","v":2.0413520589677874},{"$f":"IF(AnACeS_base!$C30=\"\",\"\",VLOOKUP($E30,BaseTrienal,S13,FALSE))","v":2.1264756855225992},{"$f":"IF(AnACeS_base!$C30=\"\",\"\",VLOOKUP($E30,BaseTrienal,T13,FALSE))","v":2.050238157128788},{"$f":"IF(AnACeS_base!$C30=\"\",\"\",VLOOKUP($E30,BaseTrienal,U13,FALSE))","v":2.151698668294133},{"$f":"IF(AnACeS_base!$C30=\"\",\"\",VLOOKUP($E30,BaseTrienal,V13,FALSE))","v":2.0311777528238326},{"$f":"IF(AnACeS_base!$C30=\"\",\"\",VLOOKUP($E30,BaseTrienal,W13,FALSE))","v":1.9604550606607614},{"$f":"IF(AnACeS_base!$C30=\"\",\"\",VLOOKUP($E30,BaseTrienal,X13,FALSE))","v":2.1145134764167861}]
["I17","Taxa de Mortalidade Neonatal","R02","Região Alentejo","I17R02",{"$f":"IF(AnACeS_base!$C31=\"\",\"\",VLOOKUP($E31,BaseTrienal,F13,FALSE))","v":3.2801224579050952},{"$f":"IF(AnACeS_base!$C31=\"\",\"\",VLOOKUP($E31,BaseTrienal,G13,FALSE))","v":3.1397174254317113},{"$f":"IF(AnACeS_base!$C31=\"\",\"\",VLOOKUP($E31,BaseTrienal,H13,FALSE))","v":2.6205821942063885},{"$f":"IF(AnACeS_base!$C31=\"\",\"\",VLOOKUP($E31,BaseTrienal,I13,FALSE))","v":2.5919792641658868},{"$f":"IF(AnACeS_base!$C31=\"\",\"\",VLOOKUP($E31,BaseTrienal,J13,FALSE))","v":2.9103608847497093},{"$f":"IF(AnACeS_base!$C31=\"\",\"\",VLOOKUP($E31,BaseTrienal,K13,FALSE))","v":3.1703900317039002},{"$f":"IF(AnACeS_base!$C31=\"\",\"\",VLOOKUP($E31,BaseTrienal,L13,FALSE))","v":3.570908030899286},{"$f":"IF(AnACeS_base!$C31=\"\",\"\",VLOOKUP($E31,BaseTrienal,M13,FALSE))","v":3.221319276667399},{"$f":"IF(AnACeS_base!$C31=\"\",\"\",VLOOKUP($E31,BaseTrienal,N13,FALSE))","v":2.9626253418413855},{"$f":"IF(AnACeS_base!$C31=\"\",\"\",VLOOKUP($E31,BaseTrienal,O13,FALSE))","v":2.3845481281297194},{"$f":"IF(AnACeS_base!$C31=\"\",\"\",VLOOKUP($E31,BaseTrienal,P13,FALSE))","v":2.1970868256164051},{"$f":"IF(AnACeS_base!$C31=\"\",\"\",VLOOKUP($E31,BaseTrienal,Q13,FALSE))","v":2.6175869120654394},{"$f":"IF(AnACeS_base!$C31=\"\",\"\",VLOOKUP($E31,BaseTrienal,R13,FALSE))","v":2.263357853043408},{"$f":"IF(AnACeS_base!$C31=\"\",\"\",VLOOKUP($E31,BaseTrienal,S13,FALSE))","v":2.1999511121975068},{"$f":"IF(AnACeS_base!$C31=\"\",\"\",VLOOKUP($E31,BaseTrienal,T13,FALSE))","v":2.1360499507065396},{"$f":"IF(AnACeS_base!$C31=\"\",\"\",VLOOKUP($E31,BaseTrienal,U13,FALSE))","v":2.2493295267756728},{"$f":"IF(AnACeS_base!$C31=\"\",\"\",VLOOKUP($E31,BaseTrienal,V13,FALSE))","v":2.3007546475243883},{"$f":"IF(AnACeS_base!$C31=\"\",\"\",VLOOKUP($E31,BaseTrienal,W13,FALSE))","v":1.7076178730670715},{"$f":"IF(AnACeS_base!$C31=\"\",\"\",VLOOKUP($E31,BaseTrienal,X13,FALSE))","v":1.4998125234345707}]
["I17","Taxa de Mortalidade Neonatal",{"$f":"IF(AnACeS_Select=1,\"\",VLOOKUP(AnACeS_Select,AnACeS_tab,2,FALSE))","v":""},{"$f":"IF(AnACeS_Select=1,\"\",VLOOKUP(AnACeS_Select,AnACeS_tab,3,FALSE))","v":""},{"$f":"IF(C32=\"\",\"\",CONCATENATE(A32,C32))","v":""},{"$f":"IF(AnACeS_base!$C32=\"\",\"\",VLOOKUP($E32,BaseTrienal,F13,FALSE))","v":""},{"$f":"IF(AnACeS_base!$C32=\"\",\"\",VLOOKUP($E32,BaseTrienal,G13,FALSE))","v":""},{"$f":"IF(AnACeS_base!$C32=\"\",\"\",VLOOKUP($E32,BaseTrienal,H13,FALSE))","v":""},{"$f":"IF(AnACeS_base!$C32=\"\",\"\",VLOOKUP($E32,BaseTrienal,I13,FALSE))","v":""},{"$f":"IF(AnACeS_base!$C32=\"\",\"\",VLOOKUP($E32,BaseTrienal,J13,FALSE))","v":""},{"$f":"IF(AnACeS_base!$C32=\"\",\"\",VLOOKUP($E32,BaseTrienal,K13,FALSE))","v":""},{"$f":"IF(AnACeS_base!$C32=\"\",\"\",VLOOKUP($E32,BaseTrienal,L13,FALSE))","v":""},{"$f":"IF(AnACeS_base!$C32=\"\",\"\",VLOOKUP($E32,BaseTrienal,M13,FALSE))","v":""},{"$f":"IF(AnACeS_base!$C32=\"\",\"\",VLOOKUP($E32,BaseTrienal,N13,FALSE))","v":""},{"$f":"IF(AnACeS_base!$C32=\"\",\"\",VLOOKUP($E32,BaseTrienal,O13,FALSE))","v":""},{"$f":"IF(AnACeS_base!$C32=\"\",\"\",VLOOKUP($E32,BaseTrienal,P13,FALSE))","v":""},{"$f":"IF(AnACeS_base!$C32=\"\",\"\",VLOOKUP($E32,BaseTrienal,Q13,FALSE))","v":""},{"$f":"IF(AnACeS_base!$C32=\"\",\"\",VLOOKUP($E32,BaseTrienal,R13,FALSE))","v":""},{"$f":"IF(AnACeS_base!$C32=\"\",\"\",VLOOKUP($E32,BaseTrienal,S13,FALSE))","v":""},{"$f":"IF(AnACeS_base!$C32=\"\",\"\",VLOOKUP($E32,BaseTrienal,T13,FALSE))","v":""},{"$f":"IF(AnACeS_base!$C32=\"\",\"\",VLOOKUP($E32,BaseTrienal,$U$13,FALSE))","v":""},{"$f":"IF(AnACeS_base!$C32=\"\",\"\",VLOOKUP($E32,BaseTrienal,$V$13,FALSE))","v":""},{"$f":"IF(AnACeS_base!$C32=\"\",\"\",VLOOKUP($E32,BaseTrienal,$W$13,FALSE))","v":""},{"$f":"IF(AnACeS_base!$C32=\"\",\"\",VLOOKUP($E32,BaseTrienal,$X$13,FALSE))","v":""}]
["I19","Taxa de Mortalidade Neonatal Precoce","R01","Continente","I19R01",{"$f":"IF(AnACeS_base!$C33=\"\",\"\",VLOOKUP($E33,BaseTrienal,F13,FALSE))","v":2.843850213367674},{"$f":"IF(AnACeS_base!$C33=\"\",\"\",VLOOKUP($E33,BaseTrienal,G13,FALSE))","v":2.6787624365576663},{"$f":"IF(AnACeS_base!$C33=\"\",\"\",VLOOKUP($E33,BaseTrienal,H13,FALSE))","v":2.5792278095376813},{"$f":"IF(AnACeS_base!$C33=\"\",\"\",VLOOKUP($E33,BaseTrienal,I13,FALSE))","v":2.3573871886942626},{"$f":"IF(AnACeS_base!$C33=\"\",\"\",VLOOKUP($E33,BaseTrienal,J13,FALSE))","v":2.3476397074292126},{"$f":"IF(AnACeS_base!$C33=\"\",\"\",VLOOKUP($E33,BaseTrienal,K13,FALSE))","v":2.2093903765312257},{"$f":"IF(AnACeS_base!$C33=\"\",\"\",VLOOKUP($E33,BaseTrienal,L13,FALSE))","v":2.0835103687687462},{"$f":"IF(AnACeS_base!$C33=\"\",\"\",VLOOKUP($E33,BaseTrienal,M13,FALSE))","v":1.7510168998693127},{"$f":"IF(AnACeS_base!$C33=\"\",\"\",VLOOKUP($E33,BaseTrienal,N13,FALSE))","v":1.5859444854164899},{"$f":"IF(AnACeS_base!$C33=\"\",\"\",VLOOKUP($E33,BaseTrienal,O13,FALSE))","v":1.5530330802711474},{"$f":"IF(AnACeS_base!$C33=\"\",\"\",VLOOKUP($E33,BaseTrienal,P13,FALSE))","v":1.5286021069006916},{"$f":"IF(AnACeS_base!$C33=\"\",\"\",VLOOKUP($E33,BaseTrienal,Q13,FALSE))","v":1.5466438861063843},{"$f":"IF(AnACeS_base!$C33=\"\",\"\",VLOOKUP($E33,BaseTrienal,R13,FALSE))","v":1.3988960810185345},{"$f":"IF(AnACeS_base!$C33=\"\",\"\",VLOOKUP($E33,BaseTrienal,S13,FALSE))","v":1.3999298263023776},{"$f":"IF(AnACeS_base!$C33=\"\",\"\",VLOOKUP($E33,BaseTrienal,T13,FALSE))","v":1.3619439186641233},{"$f":"IF(AnACeS_base!$C33=\"\",\"\",VLOOKUP($E33,BaseTrienal,U13,FALSE))","v":1.4083845828834327},{"$f":"IF(AnACeS_base!$C33=\"\",\"\",VLOOKUP($E33,BaseTrienal,V13,FALSE))","v":1.391274192482991},{"$f":"IF(AnACeS_base!$C33=\"\",\"\",VLOOKUP($E33,BaseTrienal,W13,FALSE))","v":1.3307585743671551},{"$f":"IF(AnACeS_base!$C33=\"\",\"\",VLOOKUP($E33,BaseTrienal,X13,FALSE))","v":1.4055537923160311}]
["I19","Taxa de Mortalidade Neonatal Precoce","R02","Região Alentejo","I19R02",{"$f":"IF(AnACeS_base!$C34=\"\",\"\",VLOOKUP($E34,BaseTrienal,F13,FALSE))","v":1.8222902543917197},{"$f":"IF(AnACeS_base!$C34=\"\",\"\",VLOOKUP($E34,BaseTrienal,G13,FALSE))","v":1.7839303553589267},{"$f":"IF(AnACeS_base!$C34=\"\",\"\",VLOOKUP($E34,BaseTrienal,H13,FALSE))","v":1.8414901905234082},{"$f":"IF(AnACeS_base!$C34=\"\",\"\",VLOOKUP($E34,BaseTrienal,I13,FALSE))","v":1.8719850241198071},{"$f":"IF(AnACeS_base!$C34=\"\",\"\",VLOOKUP($E34,BaseTrienal,J13,FALSE))","v":2.037252619324796},{"$f":"IF(AnACeS_base!$C34=\"\",\"\",VLOOKUP($E34,BaseTrienal,K13,FALSE))","v":2.2856300228563002},{"$f":"IF(AnACeS_base!$C34=\"\",\"\",VLOOKUP($E34,BaseTrienal,L13,FALSE))","v":2.6963999416994606},{"$f":"IF(AnACeS_base!$C34=\"\",\"\",VLOOKUP($E34,BaseTrienal,M13,FALSE))","v":2.6356248627278718},{"$f":"IF(AnACeS_base!$C34=\"\",\"\",VLOOKUP($E34,BaseTrienal,N13,FALSE))","v":2.4308720753570343},{"$f":"IF(AnACeS_base!$C34=\"\",\"\",VLOOKUP($E34,BaseTrienal,O13,FALSE))","v":1.9076385025037754},{"$f":"IF(AnACeS_base!$C34=\"\",\"\",VLOOKUP($E34,BaseTrienal,P13,FALSE))","v":1.8715924810806412},{"$f":"IF(AnACeS_base!$C34=\"\",\"\",VLOOKUP($E34,BaseTrienal,Q13,FALSE))","v":2.2085889570552149},{"$f":"IF(AnACeS_base!$C34=\"\",\"\",VLOOKUP($E34,BaseTrienal,R13,FALSE))","v":1.9400210168943497},{"$f":"IF(AnACeS_base!$C34=\"\",\"\",VLOOKUP($E34,BaseTrienal,S13,FALSE))","v":1.7925527580868574},{"$f":"IF(AnACeS_base!$C34=\"\",\"\",VLOOKUP($E34,BaseTrienal,T13,FALSE))","v":1.807426881367072},{"$f":"IF(AnACeS_base!$C34=\"\",\"\",VLOOKUP($E34,BaseTrienal,U13,FALSE))","v":1.9032788303486461},{"$f":"IF(AnACeS_base!$C34=\"\",\"\",VLOOKUP($E34,BaseTrienal,V13,FALSE))","v":1.8406037180195105},{"$f":"IF(AnACeS_base!$C34=\"\",\"\",VLOOKUP($E34,BaseTrienal,W13,FALSE))","v":1.3281472346077221},{"$f":"IF(AnACeS_base!$C34=\"\",\"\",VLOOKUP($E34,BaseTrienal,X13,FALSE))","v":1.124859392575928}]
["I19","Taxa de Mortalidade Neonatal Precoce",{"$f":"IF(AnACeS_Select=1,\"\",VLOOKUP(AnACeS_Select,AnACeS_tab,2,FALSE))","v":""},{"$f":"IF(AnACeS_Select=1,\"\",VLOOKUP(AnACeS_Select,AnACeS_tab,3,FALSE))","v":""},{"$f":"IF(C35=\"\",\"\",CONCATENATE(A35,C35))","v":""},{"$f":"IF(AnACeS_base!$C35=\"\",\"\",VLOOKUP($E35,BaseTrienal,F13,FALSE))","v":""},{"$f":"IF(AnACeS_base!$C35=\"\",\"\",VLOOKUP($E35,BaseTrienal,G13,FALSE))","v":""},{"$f":"IF(AnACeS_base!$C35=\"\",\"\",VLOOKUP($E35,BaseTrienal,H13,FALSE))","v":""},{"$f":"IF(AnACeS_base!$C35=\"\",\"\",VLOOKUP($E35,BaseTrienal,I13,FALSE))","v":""},{"$f":"IF(AnACeS_base!$C35=\"\",\"\",VLOOKUP($E35,BaseTrienal,J13,FALSE))","v":""},{"$f":"IF(AnACeS_base!$C35=\"\",\"\",VLOOKUP($E35,BaseTrienal,K13,FALSE))","v":""},{"$f":"IF(AnACeS_base!$C35=\"\",\"\",VLOOKUP($E35,BaseTrienal,L13,FALSE))","v":""},{"$f":"IF(AnACeS_base!$C35=\"\",\"\",VLOOKUP($E35,BaseTrienal,M13,FALSE))","v":""},{"$f":"IF(AnACeS_base!$C35=\"\",\"\",VLOOKUP($E35,BaseTrienal,N13,FALSE))","v":""},{"$f":"IF(AnACeS_base!$C35=\"\",\"\",VLOOKUP($E35,BaseTrienal,O13,FALSE))","v":""},{"$f":"IF(AnACeS_base!$C35=\"\",\"\",VLOOKUP($E35,BaseTrienal,P13,FALSE))","v":""},{"$f":"IF(AnACeS_base!$C35=\"\",\"\",VLOOKUP($E35,BaseTrienal,Q13,FALSE))","v":""},{"$f":"IF(AnACeS_base!$C35=\"\",\"\",VLOOKUP($E35,BaseTrienal,R13,FALSE))","v":""},{"$f":"IF(AnACeS_base!$C35=\"\",\"\",VLOOKUP($E35,BaseTrienal,S13,FALSE))","v":""},{"$f":"IF(AnACeS_base!$C35=\"\",\"\",VLOOKUP($E35,BaseTrienal,T13,FALSE))","v":""},{"$f":"IF(AnACeS_base!$C35=\"\",\"\",VLOOKUP($E35,BaseTrienal,$U$13,FALSE))","v":""},{"$f":"IF(AnACeS_base!$C35=\"\",\"\",VLOOKUP($E35,BaseTrienal,$V$13,FALSE))","v":""},{"$f":"IF(AnACeS_base!$C35=\"\",\"\",VLOOKUP($E35,BaseTrienal,$W$13,FALSE))","v":""},{"$f":"IF(AnACeS_base!$C35=\"\",\"\",VLOOKUP($E35,BaseTrienal,$X$13,FALSE))","v":""}]
["I21","Taxa de Mortalidade Pós-Neonatal","R01","Continente","I21R01",{"$f":"IF(AnACeS_base!$C36=\"\",\"\",VLOOKUP($E36,BaseTrienal,F13,FALSE))","v":2.3451506199025327},{"$f":"IF(AnACeS_base!$C36=\"\",\"\",VLOOKUP($E36,BaseTrienal,G13,FALSE))","v":2.1330886068885122},{"$f":"IF(AnACeS_base!$C36=\"\",\"\",VLOOKUP($E36,BaseTrienal,H13,FALSE))","v":2.0573134763135856},{"$f":"IF(AnACeS_base!$C36=\"\",\"\",VLOOKUP($E36,BaseTrienal,I13,FALSE))","v":1.995880648159962},{"$f":"IF(AnACeS_base!$C36=\"\",\"\",VLOOKUP($E36,BaseTrienal,J13,FALSE))","v":1.872014000469528},{"$f":"IF(AnACeS_base!$C36=\"\",\"\",VLOOKUP($E36,BaseTrienal,K13,FALSE))","v":1.6702866598317871},{"$f":"IF(AnACeS_base!$C36=\"\",\"\",VLOOKUP($E36,BaseTrienal,L13,FALSE))","v":1.4288726698202578},{"$f":"IF(AnACeS_base!$C36=\"\",\"\",VLOOKUP($E36,BaseTrienal,M13,FALSE))","v":1.322848533842875},{"$f":"IF(AnACeS_base!$C36=\"\",\"\",VLOOKUP($E36,BaseTrienal,N13,FALSE))","v":1.2335123775461587},{"$f":"IF(AnACeS_base!$C36=\"\",\"\",VLOOKUP($E36,BaseTrienal,O13,FALSE))","v":1.2564237580734392},{"$f":"IF(AnACeS_base!$C36=\"\",\"\",VLOOKUP($E36,BaseTrienal,P13,FALSE))","v":1.2309981568846278},{"$f":"IF(AnACeS_base!$C36=\"\",\"\",VLOOKUP($E36,BaseTrienal,Q13,FALSE))","v":1.2366261806507617},{"$f":"IF(AnACeS_base!$C36=\"\",\"\",VLOOKUP($E36,BaseTrienal,R13,FALSE))","v":1.0603977700560248},{"$f":"IF(AnACeS_base!$C36=\"\",\"\",VLOOKUP($E36,BaseTrienal,S13,FALSE))","v":0.91792867091725527},{"$f":"IF(AnACeS_base!$C36=\"\",\"\",VLOOKUP($E36,BaseTrienal,T13,FALSE))","v":0.8933180541775434},{"$f":"IF(AnACeS_base!$C36=\"\",\"\",VLOOKUP($E36,BaseTrienal,U13,FALSE))","v":0.95457177284321548},{"$f":"IF(AnACeS_base!$C36=\"\",\"\",VLOOKUP($E36,BaseTrienal,V13,FALSE))","v":0.95779113547790473},{"$f":"IF(AnACeS_base!$C36=\"\",\"\",VLOOKUP($E36,BaseTrienal,W13,FALSE))","v":0.86898115108517693},{"$f":"IF(AnACeS_base!$C36=\"\",\"\",VLOOKUP($E36,BaseTrienal,X13,FALSE))","v":0.84085916021252305}]
["I21","Taxa de Mortalidade Pós-Neonatal","R02","Região Alentejo","I21R02",{"$f":"IF(AnACeS_base!$C37=\"\",\"\",VLOOKUP($E37,BaseTrienal,F13,FALSE))","v":1.6765070340403818},{"$f":"IF(AnACeS_base!$C37=\"\",\"\",VLOOKUP($E37,BaseTrienal,G13,FALSE))","v":1.4271442842871414},{"$f":"IF(AnACeS_base!$C37=\"\",\"\",VLOOKUP($E37,BaseTrienal,H13,FALSE))","v":1.9831432821021318},{"$f":"IF(AnACeS_base!$C37=\"\",\"\",VLOOKUP($E37,BaseTrienal,I13,FALSE))","v":1.727986176110591},{"$f":"IF(AnACeS_base!$C37=\"\",\"\",VLOOKUP($E37,BaseTrienal,J13,FALSE))","v":1.6734575087310826},{"$f":"IF(AnACeS_base!$C37=\"\",\"\",VLOOKUP($E37,BaseTrienal,K13,FALSE))","v":1.4746000147460001},{"$f":"IF(AnACeS_base!$C37=\"\",\"\",VLOOKUP($E37,BaseTrienal,L13,FALSE))","v":1.3117621337997378},{"$f":"IF(AnACeS_base!$C37=\"\",\"\",VLOOKUP($E37,BaseTrienal,M13,FALSE))","v":1.2446006296214949},{"$f":"IF(AnACeS_base!$C37=\"\",\"\",VLOOKUP($E37,BaseTrienal,N13,FALSE))","v":0.83561227590398057},{"$f":"IF(AnACeS_base!$C37=\"\",\"\",VLOOKUP($E37,BaseTrienal,O13,FALSE))","v":1.2717590016691835},{"$f":"IF(AnACeS_base!$C37=\"\",\"\",VLOOKUP($E37,BaseTrienal,P13,FALSE))","v":1.6274717226788185},{"$f":"IF(AnACeS_base!$C37=\"\",\"\",VLOOKUP($E37,BaseTrienal,Q13,FALSE))","v":2.0449897750511248},{"$f":"IF(AnACeS_base!$C37=\"\",\"\",VLOOKUP($E37,BaseTrienal,R13,FALSE))","v":1.7783525988198206},{"$f":"IF(AnACeS_base!$C37=\"\",\"\",VLOOKUP($E37,BaseTrienal,S13,FALSE))","v":1.1407153915098183},{"$f":"IF(AnACeS_base!$C37=\"\",\"\",VLOOKUP($E37,BaseTrienal,T13,FALSE))","v":0.49293460400920147},{"$f":"IF(AnACeS_base!$C37=\"\",\"\",VLOOKUP($E37,BaseTrienal,U13,FALSE))","v":0.60558871874729647},{"$f":"IF(AnACeS_base!$C37=\"\",\"\",VLOOKUP($E37,BaseTrienal,V13,FALSE))","v":0.73624148720780414},{"$f":"IF(AnACeS_base!$C37=\"\",\"\",VLOOKUP($E37,BaseTrienal,W13,FALSE))","v":1.3281472346077221},{"$f":"IF(AnACeS_base!$C37=\"\",\"\",VLOOKUP($E37,BaseTrienal,X13,FALSE))","v":1.0311211098612674}]
["I21","Taxa de Mortalidade Pós-Neonatal",{"$f":"IF(AnACeS_Select=1,\"\",VLOOKUP(AnACeS_Select,AnACeS_tab,2,FALSE))","v":""},{"$f":"IF(AnACeS_Select=1,\"\",VLOOKUP(AnACeS_Select,AnACeS_tab,3,FALSE))","v":""},{"$f":"IF(C38=\"\",\"\",CONCATENATE(A38,C38))","v":""},{"$f":"IF(AnACeS_base!$C38=\"\",\"\",VLOOKUP($E38,BaseTrienal,F13,FALSE))","v":""},{"$f":"IF(AnACeS_base!$C38=\"\",\"\",VLOOKUP($E38,BaseTrienal,G13,FALSE))","v":""},{"$f":"IF(AnACeS_base!$C38=\"\",\"\",VLOOKUP($E38,BaseTrienal,H13,FALSE))","v":""},{"$f":"IF(AnACeS_base!$C38=\"\",\"\",VLOOKUP($E38,BaseTrienal,I13,FALSE))","v":""},{"$f":"IF(AnACeS_base!$C38=\"\",\"\",VLOOKUP($E38,BaseTrienal,J13,FALSE))","v":""},{"$f":"IF(AnACeS_base!$C38=\"\",\"\",VLOOKUP($E38,BaseTrienal,K13,FALSE))","v":""},{"$f":"IF(AnACeS_base!$C38=\"\",\"\",VLOOKUP($E38,BaseTrienal,L13,FALSE))","v":""},{"$f":"IF(AnACeS_base!$C38=\"\",\"\",VLOOKUP($E38,BaseTrienal,M13,FALSE))","v":""},{"$f":"IF(AnACeS_base!$C38=\"\",\"\",VLOOKUP($E38,BaseTrienal,N13,FALSE))","v":""},{"$f":"IF(AnACeS_base!$C38=\"\",\"\",VLOOKUP($E38,BaseTrienal,O13,FALSE))","v":""},{"$f":"IF(AnACeS_base!$C38=\"\",\"\",VLOOKUP($E38,BaseTrienal,P13,FALSE))","v":""},{"$f":"IF(AnACeS_base!$C38=\"\",\"\",VLOOKUP($E38,BaseTrienal,Q13,FALSE))","v":""},{"$f":"IF(AnACeS_base!$C38=\"\",\"\",VLOOKUP($E38,BaseTrienal,R13,FALSE))","v":""},{"$f":"IF(AnACeS_base!$C38=\"\",\"\",VLOOKUP($E38,BaseTrienal,S13,FALSE))","v":""},{"$f":"IF(AnACeS_base!$C38=\"\",\"\",VLOOKUP($E38,BaseTrienal,T13,FALSE))","v":""},{"$f":"IF(AnACeS_base!$C38=\"\",\"\",VLOOKUP($E38,BaseTrienal,$U$13,FALSE))","v":""},{"$f":"IF(AnACeS_base!$C38=\"\",\"\",VLOOKUP($E38,BaseTrienal,$V$13,FALSE))","v":""},{"$f":"IF(AnACeS_base!$C38=\"\",\"\",VLOOKUP($E38,BaseTrienal,$W$13,FALSE))","v":""},{"$f":"IF(AnACeS_base!$C38=\"\",\"\",VLOOKUP($E38,BaseTrienal,$X$13,FALSE))","v":""}]
["I23","Taxa de Mortalidade Fetal Tardia","R01","Continente","I23R01",{"$f":"IF(AnACeS_base!$C39=\"\",\"\",VLOOKUP($E39,BaseTrienal,F13,FALSE))","v":4.2022749488466529},{"$f":"IF(AnACeS_base!$C39=\"\",\"\",VLOOKUP($E39,BaseTrienal,G13,FALSE))","v":3.8513329874237145},{"$f":"IF(AnACeS_base!$C39=\"\",\"\",VLOOKUP($E39,BaseTrienal,H13,FALSE))","v":3.7364869767104403},{"$f":"IF(AnACeS_base!$C39=\"\",\"\",VLOOKUP($E39,BaseTrienal,I13,FALSE))","v":3.5537850535186712},{"$f":"IF(AnACeS_base!$C39=\"\",\"\",VLOOKUP($E39,BaseTrienal,J13,FALSE))","v":3.4636874903153472},{"$f":"IF(AnACeS_base!$C39=\"\",\"\",VLOOKUP($E39,BaseTrienal,K13,FALSE))","v":3.2087122906416181},{"$f":"IF(AnACeS_base!$C39=\"\",\"\",VLOOKUP($E39,BaseTrienal,L13,FALSE))","v":2.9685043570489427},{"$f":"IF(AnACeS_base!$C39=\"\",\"\",VLOOKUP($E39,BaseTrienal,M13,FALSE))","v":2.7594821350616741},{"$f":"IF(AnACeS_base!$C39=\"\",\"\",VLOOKUP($E39,BaseTrienal,N13,FALSE))","v":2.7855697075802643},{"$f":"IF(AnACeS_base!$C39=\"\",\"\",VLOOKUP($E39,BaseTrienal,O13,FALSE))","v":2.8446665824787152},{"$f":"IF(AnACeS_base!$C39=\"\",\"\",VLOOKUP($E39,BaseTrienal,P13,FALSE))","v":2.7688219185473972},{"$f":"IF(AnACeS_base!$C39=\"\",\"\",VLOOKUP($E39,BaseTrienal,Q13,FALSE))","v":2.6967511877728958},{"$f":"IF(AnACeS_base!$C39=\"\",\"\",VLOOKUP($E39,BaseTrienal,R13,FALSE))","v":2.5735458776756093},{"$f":"IF(AnACeS_base!$C39=\"\",\"\",VLOOKUP($E39,BaseTrienal,S13,FALSE))","v":2.5029607763420714},{"$f":"IF(AnACeS_base!$C39=\"\",\"\",VLOOKUP($E39,BaseTrienal,T13,FALSE))","v":2.4287446494572764},{"$f":"IF(AnACeS_base!$C39=\"\",\"\",VLOOKUP($E39,BaseTrienal,U13,FALSE))","v":2.3807479451413229},{"$f":"IF(AnACeS_base!$C39=\"\",\"\",VLOOKUP($E39,BaseTrienal,V13,FALSE))","v":2.3682140371253588},{"$f":"IF(AnACeS_base!$C39=\"\",\"\",VLOOKUP($E39,BaseTrienal,W13,FALSE))","v":2.3202827897002898},{"$f":"IF(AnACeS_base!$C39=\"\",\"\",VLOOKUP($E39,BaseTrienal,X13,FALSE))","v":2.3357472129354342}]
["I23","Taxa de Mortalidade Fetal Tardia","R02","Região Alentejo","I23R02",{"$f":"IF(AnACeS_base!$C40=\"\",\"\",VLOOKUP($E40,BaseTrienal,F13,FALSE))","v":3.7037037037037037},{"$f":"IF(AnACeS_base!$C40=\"\",\"\",VLOOKUP($E40,BaseTrienal,G13,FALSE))","v":4.4753853804077579},{"$f":"IF(AnACeS_base!$C40=\"\",\"\",VLOOKUP($E40,BaseTrienal,H13,FALSE))","v":4.9333991119881597},{"$f":"IF(AnACeS_base!$C40=\"\",\"\",VLOOKUP($E40,BaseTrienal,I13,FALSE))","v":5.8693006942953261},{"$f":"IF(AnACeS_base!$C40=\"\",\"\",VLOOKUP($E40,BaseTrienal,J13,FALSE))","v":5.4992764109985526},{"$f":"IF(AnACeS_base!$C40=\"\",\"\",VLOOKUP($E40,BaseTrienal,K13,FALSE))","v":4.6965583033683131},{"$f":"IF(AnACeS_base!$C40=\"\",\"\",VLOOKUP($E40,BaseTrienal,L13,FALSE))","v":3.992160847789795},{"$f":"IF(AnACeS_base!$C40=\"\",\"\",VLOOKUP($E40,BaseTrienal,M13,FALSE))","v":3.7925753045000365},{"$f":"IF(AnACeS_base!$C40=\"\",\"\",VLOOKUP($E40,BaseTrienal,N13,FALSE))","v":3.5576413594731662},{"$f":"IF(AnACeS_base!$C40=\"\",\"\",VLOOKUP($E40,BaseTrienal,O13,FALSE))","v":4.3526432415321299},{"$f":"IF(AnACeS_base!$C40=\"\",\"\",VLOOKUP($E40,BaseTrienal,P13,FALSE))","v":3.6484514350575648},{"$f":"IF(AnACeS_base!$C40=\"\",\"\",VLOOKUP($E40,BaseTrienal,Q13,FALSE))","v":3.8298565840938723},{"$f":"IF(AnACeS_base!$C40=\"\",\"\",VLOOKUP($E40,BaseTrienal,R13,FALSE))","v":3.4638311583695827},{"$f":"IF(AnACeS_base!$C40=\"\",\"\",VLOOKUP($E40,BaseTrienal,S13,FALSE))","v":3.2485990416632826},{"$f":"IF(AnACeS_base!$C40=\"\",\"\",VLOOKUP($E40,BaseTrienal,T13,FALSE))","v":3.8464686144529012},{"$f":"IF(AnACeS_base!$C40=\"\",\"\",VLOOKUP($E40,BaseTrienal,U13,FALSE))","v":3.5344827586206895},{"$f":"IF(AnACeS_base!$C40=\"\",\"\",VLOOKUP($E40,BaseTrienal,V13,FALSE))","v":3.6677058499908304},{"$f":"IF(AnACeS_base!$C40=\"\",\"\",VLOOKUP($E40,BaseTrienal,W13,FALSE))","v":2.8379528899820263},{"$f":"IF(AnACeS_base!$C40=\"\",\"\",VLOOKUP($E40,BaseTrienal,X13,FALSE))","v":2.8042624789680315}]
["I23","Taxa de Mortalidade Fetal Tardia",{"$f":"IF(AnACeS_Select=1,\"\",VLOOKUP(AnACeS_Select,AnACeS_tab,2,FALSE))","v":""},{"$f":"IF(AnACeS_Select=1,\"\",VLOOKUP(AnACeS_Select,AnACeS_tab,3,FALSE))","v":""},{"$f":"IF(C41=\"\",\"\",CONCATENATE(A41,C41))","v":""},{"$f":"IF(AnACeS_base!$C41=\"\",\"\",VLOOKUP($E41,BaseTrienal,F13,FALSE))","v":""},{"$f":"IF(AnACeS_base!$C41=\"\",\"\",VLOOKUP($E41,BaseTrienal,G13,FALSE))","v":""},{"$f":"IF(AnACeS_base!$C41=\"\",\"\",VLOOKUP($E41,BaseTrienal,H13,FALSE))","v":""},{"$f":"IF(AnACeS_base!$C41=\"\",\"\",VLOOKUP($E41,BaseTrienal,I13,FALSE))","v":""},{"$f":"IF(AnACeS_base!$C41=\"\",\"\",VLOOKUP($E41,BaseTrienal,J13,FALSE))","v":""},{"$f":"IF(AnACeS_base!$C41=\"\",\"\",VLOOKUP($E41,BaseTrienal,K13,FALSE))","v":""},{"$f":"IF(AnACeS_base!$C41=\"\",\"\",VLOOKUP($E41,BaseTrienal,L13,FALSE))","v":""},{"$f":"IF(AnACeS_base!$C41=\"\",\"\",VLOOKUP($E41,BaseTrienal,M13,FALSE))","v":""},{"$f":"IF(AnACeS_base!$C41=\"\",\"\",VLOOKUP($E41,BaseTrienal,N13,FALSE))","v":""},{"$f":"IF(AnACeS_base!$C41=\"\",\"\",VLOOKUP($E41,BaseTrienal,O13,FALSE))","v":""},{"$f":"IF(AnACeS_base!$C41=\"\",\"\",VLOOKUP($E41,BaseTrienal,P13,FALSE))","v":""},{"$f":"IF(AnACeS_base!$C41=\"\",\"\",VLOOKUP($E41,BaseTrienal,Q13,FALSE))","v":""},{"$f":"IF(AnACeS_base!$C41=\"\",\"\",VLOOKUP($E41,BaseTrienal,R13,FALSE))","v":""},{"$f":"IF(AnACeS_base!$C41=\"\",\"\",VLOOKUP($E41,BaseTrienal,S13,FALSE))","v":""},{"$f":"IF(AnACeS_base!$C41=\"\",\"\",VLOOKUP($E41,BaseTrienal,T13,FALSE))","v":""},{"$f":"IF(AnACeS_base!$C41=\"\",\"\",VLOOKUP($E41,BaseTrienal,$U$13,FALSE))","v":""},{"$f":"IF(AnACeS_base!$C41=\"\",\"\",VLOOKUP($E41,BaseTrienal,$V$13,FALSE))","v":""},{"$f":"IF(AnACeS_base!$C41=\"\",\"\",VLOOKUP($E41,BaseTrienal,$W$13,FALSE))","v":""},{"$f":"IF(AnACeS_base!$C41=\"\",\"\",VLOOKUP($E41,BaseTrienal,$X$13,FALSE))","v":""}]
["I25","Taxa de Mortalidade Perinatal","R01","Continente","I25R01",{"$f":"IF(AnACeS_base!$C42=\"\",\"\",VLOOKUP($E42,BaseTrienal,F13,FALSE))","v":7.0341745217044203},{"$f":"IF(AnACeS_base!$C42=\"\",\"\",VLOOKUP($E42,BaseTrienal,G13,FALSE))","v":6.5197786178439951},{"$f":"IF(AnACeS_base!$C42=\"\",\"\",VLOOKUP($E42,BaseTrienal,H13,FALSE))","v":6.3060775351278151},{"$f":"IF(AnACeS_base!$C42=\"\",\"\",VLOOKUP($E42,BaseTrienal,I13,FALSE))","v":5.9027945948563953},{"$f":"IF(AnACeS_base!$C42=\"\",\"\",VLOOKUP($E42,BaseTrienal,J13,FALSE))","v":5.8031957074581699},{"$f":"IF(AnACeS_base!$C42=\"\",\"\",VLOOKUP($E42,BaseTrienal,K13,FALSE))","v":5.4110133691168434},{"$f":"IF(AnACeS_base!$C42=\"\",\"\",VLOOKUP($E42,BaseTrienal,L13,FALSE))","v":5.0458298162100421},{"$f":"IF(AnACeS_base!$C42=\"\",\"\",VLOOKUP($E42,BaseTrienal,M13,FALSE))","v":4.5056671350776067},{"$f":"IF(AnACeS_base!$C42=\"\",\"\",VLOOKUP($E42,BaseTrienal,N13,FALSE))","v":4.3670964340802731},{"$f":"IF(AnACeS_base!$C42=\"\",\"\",VLOOKUP($E42,BaseTrienal,O13,FALSE))","v":4.3932818014449309},{"$f":"IF(AnACeS_base!$C42=\"\",\"\",VLOOKUP($E42,BaseTrienal,P13,FALSE))","v":4.2931915984297637},{"$f":"IF(AnACeS_base!$C42=\"\",\"\",VLOOKUP($E42,BaseTrienal,Q13,FALSE))","v":4.2392241601423608},{"$f":"IF(AnACeS_base!$C42=\"\",\"\",VLOOKUP($E42,BaseTrienal,R13,FALSE))","v":3.968841835451542},{"$f":"IF(AnACeS_base!$C42=\"\",\"\",VLOOKUP($E42,BaseTrienal,S13,FALSE))","v":3.8993866331995828},{"$f":"IF(AnACeS_base!$C42=\"\",\"\",VLOOKUP($E42,BaseTrienal,T13,FALSE))","v":3.7873807541160827},{"$f":"IF(AnACeS_base!$C42=\"\",\"\",VLOOKUP($E42,BaseTrienal,U13,FALSE))","v":3.785779519323087},{"$f":"IF(AnACeS_base!$C42=\"\",\"\",VLOOKUP($E42,BaseTrienal,V13,FALSE))","v":3.7561933945362216},{"$f":"IF(AnACeS_base!$C42=\"\",\"\",VLOOKUP($E42,BaseTrienal,W13,FALSE))","v":3.6479536278500948},{"$f":"IF(AnACeS_base!$C42=\"\",\"\",VLOOKUP($E42,BaseTrienal,X13,FALSE))","v":3.738017986898432}]
["I25","Taxa de Mortalidade Perinatal","R02","Região Alentejo","I25R02",{"$f":"IF(AnACeS_base!$C43=\"\",\"\",VLOOKUP($E43,BaseTrienal,F13,FALSE))","v":5.5192447349310099},{"$f":"IF(AnACeS_base!$C43=\"\",\"\",VLOOKUP($E43,BaseTrienal,G13,FALSE))","v":6.2513319599346451},{"$f":"IF(AnACeS_base!$C43=\"\",\"\",VLOOKUP($E43,BaseTrienal,H13,FALSE))","v":6.7658044964409054},{"$f":"IF(AnACeS_base!$C43=\"\",\"\",VLOOKUP($E43,BaseTrienal,I13,FALSE))","v":7.7302984754133561},{"$f":"IF(AnACeS_base!$C43=\"\",\"\",VLOOKUP($E43,BaseTrienal,J13,FALSE))","v":7.5253256150506509},{"$f":"IF(AnACeS_base!$C43=\"\",\"\",VLOOKUP($E43,BaseTrienal,K13,FALSE))","v":6.9714537315623391},{"$f":"IF(AnACeS_base!$C43=\"\",\"\",VLOOKUP($E43,BaseTrienal,L13,FALSE))","v":6.67779632721202},{"$f":"IF(AnACeS_base!$C43=\"\",\"\",VLOOKUP($E43,BaseTrienal,M13,FALSE))","v":6.4182043614616004},{"$f":"IF(AnACeS_base!$C43=\"\",\"\",VLOOKUP($E43,BaseTrienal,N13,FALSE))","v":5.9798652637953227},{"$f":"IF(AnACeS_base!$C43=\"\",\"\",VLOOKUP($E43,BaseTrienal,O13,FALSE))","v":6.2519784742006959},{"$f":"IF(AnACeS_base!$C43=\"\",\"\",VLOOKUP($E43,BaseTrienal,P13,FALSE))","v":5.5132155018647646},{"$f":"IF(AnACeS_base!$C43=\"\",\"\",VLOOKUP($E43,BaseTrienal,Q13,FALSE))","v":6.0299869621903515},{"$f":"IF(AnACeS_base!$C43=\"\",\"\",VLOOKUP($E43,BaseTrienal,R13,FALSE))","v":5.3971322700177211},{"$f":"IF(AnACeS_base!$C43=\"\",\"\",VLOOKUP($E43,BaseTrienal,S13,FALSE))","v":5.0353285145780884},{"$f":"IF(AnACeS_base!$C43=\"\",\"\",VLOOKUP($E43,BaseTrienal,T13,FALSE))","v":5.6469432850478762},{"$f":"IF(AnACeS_base!$C43=\"\",\"\",VLOOKUP($E43,BaseTrienal,U13,FALSE))","v":5.431034482758621},{"$f":"IF(AnACeS_base!$C43=\"\",\"\",VLOOKUP($E43,BaseTrienal,V13,FALSE))","v":5.501558774986246},{"$f":"IF(AnACeS_base!$C43=\"\",\"\",VLOOKUP($E43,BaseTrienal,W13,FALSE))","v":4.1623309053069724},{"$f":"IF(AnACeS_base!$C43=\"\",\"\",VLOOKUP($E43,BaseTrienal,X13,FALSE))","v":3.9259674705552441}]
["I25","Taxa de Mortalidade Perinatal",{"$f":"IF(AnACeS_Select=1,\"\",VLOOKUP(AnACeS_Select,AnACeS_tab,2,FALSE))","v":""},{"$f":"IF(AnACeS_Select=1,\"\",VLOOKUP(AnACeS_Select,AnACeS_tab,3,FALSE))","v":""},{"$f":"IF(C44=\"\",\"\",CONCATENATE(A44,C44))","v":""},{"$f":"IF(AnACeS_base!$C44=\"\",\"\",VLOOKUP($E44,BaseTrienal,F13,FALSE))","v":""},{"$f":"IF(AnACeS_base!$C44=\"\",\"\",VLOOKUP($E44,BaseTrienal,G13,FALSE))","v":""},{"$f":"IF(AnACeS_base!$C44=\"\",\"\",VLOOKUP($E44,BaseTrienal,H13,FALSE))","v":""},{"$f":"IF(AnACeS_base!$C44=\"\",\"\",VLOOKUP($E44,BaseTrienal,I13,FALSE))","v":""},{"$f":"IF(AnACeS_base!$C44=\"\",\"\",VLOOKUP($E44,BaseTrienal,J13,FALSE))","v":""},{"$f":"IF(AnACeS_base!$C44=\"\",\"\",VLOOKUP($E44,BaseTrienal,K13,FALSE))","v":""},{"$f":"IF(AnACeS_base!$C44=\"\",\"\",VLOOKUP($E44,BaseTrienal,L13,FALSE))","v":""},{"$f":"IF(AnACeS_base!$C44=\"\",\"\",VLOOKUP($E44,BaseTrienal,M13,FALSE))","v":""},{"$f":"IF(AnACeS_base!$C44=\"\",\"\",VLOOKUP($E44,BaseTrienal,N13,FALSE))","v":""},{"$f":"IF(AnACeS_base!$C44=\"\",\"\",VLOOKUP($E44,BaseTrienal,O13,FALSE))","v":""},{"$f":"IF(AnACeS_base!$C44=\"\",\"\",VLOOKUP($E44,BaseTrienal,P13,FALSE))","v":""},{"$f":"IF(AnACeS_base!$C44=\"\",\"\",VLOOKUP($E44,BaseTrienal,Q13,FALSE))","v":""},{"$f":"IF(AnACeS_base!$C44=\"\",\"\",VLOOKUP($E44,BaseTrienal,R13,FALSE))","v":""},{"$f":"IF(AnACeS_base!$C44=\"\",\"\",VLOOKUP($E44,BaseTrienal,S13,FALSE))","v":""},{"$f":"IF(AnACeS_base!$C44=\"\",\"\",VLOOKUP($E44,BaseTrienal,T13,FALSE))","v":""},{"$f":"IF(AnACeS_base!$C44=\"\",\"\",VLOOKUP($E44,BaseTrienal,$U$13,FALSE))","v":""},{"$f":"IF(AnACeS_base!$C44=\"\",\"\",VLOOKUP($E44,BaseTrienal,$V$13,FALSE))","v":""},{"$f":"IF(AnACeS_base!$C44=\"\",\"\",VLOOKUP($E44,BaseTrienal,$W$13,FALSE))","v":""},{"$f":"IF(AnACeS_base!$C44=\"\",\"\",VLOOKUP($E44,BaseTrienal,$X$13,FALSE))","v":""}]

{"sheet":"AnIndT","index":9,"n_rows":64,"n_cols":22,"rows_kept":64,"cut":false,"hidden":false,"merged":[[58,6,58,7],[37,1,37,18],[11,6,11,7],[12,6,12,7],[13,6,13,7],[14,6,14,7],[67,1,67,20],[59,6,59,18],[60,7,60,9],[61,7,61,9],[62,7,62,9],[63,7,63,9],[10,1,10,20],[3,1,3,18],[5,1,5,5],[5,8,5,12],[1,1,1,21],[8,1,8,22]]}
[]
[null,"mort@lidades.infantil"]
[]
[null,"Análise por Indicador"]
[]
[null,"Selecione o Indicador",null,null,null,null,null,null,"Selecione o ACeS"]
[]
[]
[null,{"$f":"IF(AnInd_baseT!E1=\"A\",\"\",AnInd_baseT!D1)","v":"Proporção de Crianças com Baixo Peso à Nascença"}]
[]
[null,{"$f":"AnInd_baseT!B55","v":"PROPORÇÃO DE CRIANÇAS COM BAIXO PESO À NASCENÇA (%), 1996-2014 (MÉDIA ANUAL POR TRIÉNIOS)"}]
[null,null,"96-98","97-99","98-00","99-01","00-02",null,"01-03","02-04","03-05","04-06","05-07","06-08","07-09","08-10","09-11","10-12","11-13","12-14","13-15","14-16"]
[null,{"$f":"AnInd_baseT!B4","v":"Continente"},{"$f":"AnInd_baseT!F4","v":6.524442592732874},{"$f":"AnInd_baseT!G4","v":6.882311176702208},{"$f":"AnInd_baseT!H4","v":7.071939215186493},{"$f":"AnInd_baseT!I4","v":7.231042171712569},{"$f":"AnInd_baseT!J4","v":7.1993268066916878},null,{"$f":"AnInd_baseT!K4","v":7.3056344128911226},{"$f":"AnInd_baseT!L4","v":7.4430417992465374},{"$f":"AnInd_baseT!M4","v":7.5060470793485452},{"$f":"AnInd_baseT!N4","v":7.5629319740766601},{"$f":"AnInd_baseT!O4","v":7.6481880169833829},{"$f":"AnInd_baseT!P4","v":7.7140296589391104},{"$f":"AnInd_baseT!Q4","v":7.9181966614537762},{"$f":"AnInd_baseT!R4","v":8.0821652838895535},{"$f":"AnInd_baseT!S4","v":8.3258611340494841},{"$f":"AnInd_baseT!T4","v":8.4403911561512643},{"$f":"AnInd_baseT!U4","v":8.5551539051374732},{"$f":"AnInd_baseT!V4","v":8.6671840940616942},{"$f":"AnInd_baseT!W4","v":8.7876243650560433},{"$f":"AnInd_baseT!X4","v":8.7618348865870601}]
[null,{"$f":"AnInd_baseT!B5","v":"Região Alentejo"},{"$f":"AnInd_baseT!F5","v":6.8372330344777312},{"$f":"AnInd_baseT!G5","v":7.3212501783930346},{"$f":"AnInd_baseT!H5","v":7.6138536723563996},{"$f":"AnInd_baseT!I5","v":7.7687378500971986},{"$f":"AnInd_baseT!J5","v":7.5305587892898718},null,{"$f":"AnInd_baseT!K5","v":7.3582540735825406},{"$f":"AnInd_baseT!L5","v":7.5353447019384925},{"$f":"AnInd_baseT!M5","v":7.7018815433047809},{"$f":"AnInd_baseT!N5","v":8.2117897295654814},{"$f":"AnInd_baseT!O5","v":8.194897067005801},{"$f":"AnInd_baseT!P5","v":8.5035397509968256},{"$f":"AnInd_baseT!Q5","v":8.4335378323108383},{"$f":"AnInd_baseT!R5","v":8.859429310484197},{"$f":"AnInd_baseT!S5","v":8.8242483500366653},{"$f":"AnInd_baseT!T5","v":8.7085113374958922},{"$f":"AnInd_baseT!U5","v":8.5993598062116092},{"$f":"AnInd_baseT!V5","v":8.5219952144303335},{"$f":"AnInd_baseT!W5","v":8.8226923441798686},{"$f":"AnInd_baseT!X5","v":8.8301462317210344}]
[null,{"$f":"IF(AnInd_codACeS=\"\",\"\",AnInd_baseT!D11)","v":"ULS Norte Alentejano"},{"$f":"IF(AnInd_codACeS=\"\",\"\",AnInd_baseT!F11)","v":7.6258104353195426},{"$f":"IF(AnInd_codACeS=\"\",\"\",AnInd_baseT!G11)","v":8.1510338627509746},{"$f":"IF(AnInd_codACeS=\"\",\"\",AnInd_baseT!H11)","v":8.293838862559241},{"$f":"IF(AnInd_codACeS=\"\",\"\",AnInd_baseT!I11)","v":8.2733812949640289},{"$f":"IF(AnInd_codACeS=\"\",\"\",AnInd_baseT!J11)","v":7.5757575757575761},null,{"$f":"IF(AnInd_codACeS=\"\",\"\",AnInd_baseT!K11)","v":7.2211476466795617},{"$f":"IF(AnInd_codACeS=\"\",\"\",AnInd_baseT!L11)","v":6.7301378857518053},{"$f":"IF(AnInd_codACeS=\"\",\"\",AnInd_baseT!M11)","v":7.1834279986635483},{"$f":"IF(AnInd_codACeS=\"\",\"\",AnInd_baseT!N11)","v":7.6352067868504774},{"$f":"IF(AnInd_codACeS=\"\",\"\",AnInd_baseT!O11)","v":7.9562594268476614},{"$f":"IF(AnInd_codACeS=\"\",\"\",AnInd_baseT!P11)","v":7.5323656335817972},{"$f":"IF(AnInd_codACeS=\"\",\"\",AnInd_baseT!Q11)","v":7.4893286767559175},{"$f":"IF(AnInd_codACeS=\"\",\"\",AnInd_baseT!R11)","v":7.883971736705095},{"$f":"IF(AnInd_codACeS=\"\",\"\",AnInd_baseT!S11)","v":8.4269662921348321},{"$f":"IF(AnInd_codACeS=\"\",\"\",AnInd_baseT!T11)","v":8.1194944465721957},{"$f":"IF(AnInd_codACeS=\"\",\"\",AnInd_baseT!U11)","v":8.5542168674698793},{"$f":"IF(AnInd_codACeS=\"\",\"\",AnInd_baseT!V11)","v":8.3333333333333321},{"$f":"IF(AnInd_codACeS=\"\",\"\",AnInd_baseT!W11)","v":8.1329252295583725},{"$f":"IF(AnInd_codACeS=\"\",\"\",AnInd_baseT!X11)","v":7.3707865168539328}]
[]
[]
[]
[]
[]
[]
[]
[]
[]
[]
[]
[]
[]
[]
[]
[]
[]
[]
[]
[]
[null,"Selecione o Triénio"]
[]
[null,{"$f":"AnInd_baseT!B56","v":"PROPORÇÃO DE CRIANÇAS COM BAIXO PESO À NASCENÇA (%), MÉDIA ANUAL NO TRIÉNIO 2014-2016"}]
[null,null,null,null,null,null,null,{"$f":"IF($B35=\"\",\"\",IF(E35<$G$85,1,IF(E35<$G$86,2,IF(E35<$G$87,3,4))))","v":""}]
[]
[]
[]
[]
[]
[]
[]
[]
[]
[]
[]
[]
[]
[]
[]
[]
[]
[]
[]
[null,null,null,null,null,null,"Legenda"]
[null,null,null,null,null,null,{"$f":"AnInd_baseT!B57","v":"PROPORÇÃO DE CRIANÇAS COM BAIXO PESO À NASCENÇA (%), 2014-2016"}]
[null,null,null,null,null,null,null,{"$f":"AnInd_baseT!J30","v":7.37}]
[null,null,null,null,null,null,null,{"$f":"AnInd_baseT!J31","v":8.43}]
[null,null,null,null,null,null,null,{"$f":"AnInd_baseT!J32","v":9.19}]
[null,null,null,null,null,null,null,{"$f":"AnInd_baseT!J33","v":9.8699999999999992}]

{"sheet":"AnIndA","index":10,"n_rows":64,"n_cols":24,"rows_kept":64,"cut":false,"hidden":false,"merged":[[12,7,12,8],[13,7,13,8],[1,1,1,23],[3,1,3,23],[62,8,62,10],[8,1,8,22],[14,7,14,8],[11,7,11,8],[5,9,5,14],[10,1,10,20],[5,1,5,6],[63,8,63,10],[67,1,67,22],[37,1,37,20],[59,7,59,20],[58,7,58,8],[60,8,60,10],[61,8,61,10]]}
[]
[null,"mort@lidades.infantil"]
[]
[null,"Análise por Indicador"]
[]
[null,"Selecione o Indicador",null,null,null,null,null,null,null,"Selecione o ACeS"]
[]
[]
[null,{"$f":"IF(AnInd_baseT!E1=\"T\",\"\",AnInd_baseT!D1)","v":""}]
[]
[null,{"$f":"AnInd_baseA!B55","v":""}]
[null,null,1996,1997,1998,1999,2000,2001,null,2002,2003,2004,2005,2006,2007,2008,2009,2010,2011,2012,2013,2014,2015,2016]
[null,{"$f":"AnInd_baseA!B4","v":"Continente"},{"$f":"AnInd_baseA!F4","v":""},{"$f":"AnInd_baseA!G4","v":""},{"$f":"AnInd_baseA!H4","v":""},{"$f":"AnInd_baseA!I4","v":""},{"$f":"AnInd_baseA!J4","v":""},{"$f":"AnInd_baseA!K4","v":""},null,{"$f":"AnInd_baseA!L4","v":""},{"$f":"AnInd_baseA!M4","v":""},{"$f":"AnInd_baseA!N4","v":""},{"$f":"AnInd_baseA!O4","v":""},{"$f":"AnInd_baseA!P4","v":""},{"$f":"AnInd_baseA!Q4","v":""},{"$f":"AnInd_baseA!R4","v":""},{"$f":"AnInd_baseA!S4","v":""},{"$f":"AnInd_baseA!T4","v":""},{"$f":"AnInd_baseA!U4","v":""},{"$f":"AnInd_baseA!V4","v":""},{"$f":"AnInd_baseA!W4","v":""},{"$f":"AnInd_baseA!X4","v":""},{"$f":"AnInd_baseA!Y4","v":""},{"$f":"AnInd_baseA!Z4","v":""}]
[null,{"$f":"AnInd_baseA!B5","v":"Região Alentejo"},{"$f":"AnInd_baseA!F5","v":""},{"$f":"AnInd_baseA!G5","v":""},{"$f":"AnInd_baseA!H5","v":""},{"$f":"AnInd_baseA!I5","v":""},{"$f":"AnInd_baseA!J5","v":""},{"$f":"AnInd_baseA!K5","v":""},null,{"$f":"AnInd_baseA!L5","v":""},{"$f":"AnInd_baseA!M5","v":""},{"$f":"AnInd_baseA!N5","v":""},{"$f":"AnInd_baseA!O5","v":""},{"$f":"AnInd_baseA!P5","v":""},{"$f":"AnInd_baseA!Q5","v":""},{"$f":"AnInd_baseA!R5","v":""},{"$f":"AnInd_baseA!S5","v":""},{"$f":"AnInd_baseA!T5","v":""},{"$f":"AnInd_baseA!U5","v":""},{"$f":"AnInd_baseA!V5","v":""},{"$f":"AnInd_baseA!W5","v":""},{"$f":"AnInd_baseA!X5","v":""},{"$f":"AnInd_baseA!Y5","v":""},{"$f":"AnInd_baseA!Z5","v":""}]
[null,{"$f":"AnInd_baseA!D11","v":"ULS Norte Alentejano"},{"$f":"AnInd_baseA!F11","v":""},{"$f":"AnInd_baseA!G11","v":""},{"$f":"AnInd_baseA!H11","v":""},{"$f":"AnInd_baseA!I11","v":""},{"$f":"AnInd_baseA!J11","v":""},{"$f":"AnInd_baseA!K11","v":""},null,{"$f":"AnInd_baseA!L11","v":""},{"$f":"AnInd_baseA!M11","v":""},{"$f":"AnInd_baseA!N11","v":""},{"$f":"AnInd_baseA!O11","v":""},{"$f":"AnInd_baseA!P11","v":""},{"$f":"AnInd_baseA!Q11","v":""},{"$f":"AnInd_baseA!R11","v":""},{"$f":"AnInd_baseA!S11","v":""},{"$f":"AnInd_baseA!T11","v":""},{"$f":"AnInd_baseA!U11","v":""},{"$f":"AnInd_baseA!V11","v":""},{"$f":"AnInd_baseA!W11","v":""},{"$f":"AnInd_baseA!X11","v":""},{"$f":"AnInd_baseA!Y11","v":""},{"$f":"AnInd_baseA!Z11","v":""}]
[]
[]
[]
[]
[]
[]
[]
[]
[]
[]
[]
[]
[]
[]
[]
[]
[]
[]
[]
[]
[null,"Selecione o Ano"]
[]
[null,{"$f":"AnInd_baseA!B56","v":""}]
[]
[]
[]
[]
[]
[]
[]
[]
[]
[]
[]
[]
[]
[]
[]
[]
[]
[]
[]
[]
[null,null,null,null,null,null,null,"Legenda"]
[null,null,null,null,null,null,null,{"$f":"AnInd_baseA!B56","v":""}]
[null,null,null,null,null,null,null,null,{"$f":"AnInd_baseA!K31","v":""}]
[null,null,null,null,null,null,null,null,{"$f":"AnInd_baseA!K32","v":""}]
[null,null,null,null,null,null,null,null,{"$f":"AnInd_baseA!K33","v":""}]
[null,null,null,null,null,null,null,null,{"$f":"AnInd_baseA!K34","v":""}]

{"sheet":"AnInd_baseT","index":11,"n_rows":57,"n_cols":24,"rows_kept":57,"cut":false,"hidden":true,"merged":[]}
[6,"AnInd_Select",{"$f":"IF(AnInd_Select=1,\"\",VLOOKUP(AnInd_Select,AnInd_tab,3,FALSE))","v":"I10"},{"$f":"IF(AnInd_Select=1,\"\",VLOOKUP(AnInd_Select,AnInd_tab,4,FALSE))","v":"Proporção de Crianças com Baixo Peso à Nascença"},{"$f":"IF(AnInd_Select=1,\"\",VLOOKUP(AnInd_Select,AnInd_tab,2,FALSE))","v":"T"}]
[null,null,null,{"$f":"IF(AnInd_Select=1,\"\",VLOOKUP(AnInd_Select,AnInd_tabLeg,5,FALSE))","v":"PROPORÇÃO DE CRIANÇAS COM BAIXO PESO À NASCENÇA"},{"$f":"IF(AnInd_Select=1,\"\",VLOOKUP(AnInd_Select,AnInd_tabLeg,6,FALSE))","v":"(%)"},{"$f":"IF(AnInd_Select=1,\"\",VLOOKUP(AnInd_Select,AnInd_tabLeg,7,FALSE))","v":"(MÉDIA ANUAL POR TRIÉNIOS)"}]
["Rcod","Local_Residencia","Icod","Indicador","cod_IndRes","96-98","97-99","98-00","99-01","00-02","01-03","02-04","03-05","04-06","05-07","06-08","07-09","08-10","09-11","10-12","11-13","12-14","13-15","14-16"]
[{"$f":"Id!D39","v":"R01"},{"$f":"Id!F39","v":"Continente"},{"$f":"IF(TipoAn=\"T\",$C$1,\"\")","v":"I10"},{"$f":"IF(TipoAn=\"T\",$D$1,\"\")","v":"Proporção de Crianças com Baixo Peso à Nascença"},{"$f":"IF(C4=\"\",\"\",CONCATENATE(C4,A4))","v":"I10R01"},{"$f":"IF($C$4=\"\",\"\",VLOOKUP($E4,BaseTrienal,F$10,FALSE))","v":6.524442592732874},6.882311176702208,7.071939215186493,7.231042171712569,7.1993268066916878,7.3056344128911226,7.4430417992465374,7.5060470793485452,7.5629319740766601,7.6481880169833829,7.7140296589391104,7.9181966614537762,8.0821652838895535,8.3258611340494841,8.4403911561512643,8.5551539051374732,8.6671840940616942,8.7876243650560433,8.7618348865870601]
[{"$f":"Id!D40","v":"R02"},{"$f":"Id!F40","v":"Região Alentejo"},"I10","Proporção de Crianças com Baixo Peso à Nascença",{"$f":"IF(C5=\"\",\"\",CONCATENATE(C5,A5))","v":"I10R02"},{"$f":"IF($C$5=\"\",\"\",VLOOKUP($E5,BaseTrienal,F$10,FALSE))","v":6.8372330344777312},7.3212501783930346,7.6138536723563996,7.7687378500971986,7.5305587892898718,7.3582540735825406,7.5353447019384925,7.7018815433047809,8.2117897295654814,8.194897067005801,8.5035397509968256,8.4335378323108383,8.859429310484197,8.8242483500366653,8.7085113374958922,8.5993598062116092,8.5219952144303335,8.8226923441798686,8.8301462317210344]
[{"$f":"Id!D41","v":"R03"},{"$f":"Id!F41","v":"ACeS Alentejo Central"},"I10","Proporção de Crianças com Baixo Peso à Nascença","I10R03",{"$f":"IF($C$6=\"\",\"\",VLOOKUP($E6,BaseTrienal,F$10,FALSE))","v":6.6220880069025014},7.3972022043238663,7.3113708820403831,7.7121930202498925,7.5770733825445067,8.0479825517993451,8.3440583440583449,8.4277003484320563,8.788757528440776,8.5046728971962615,9.0070921985815602,8.7116564417177909,9.0121317157712308,8.8198446504635424,9.338031714069972,8.804204993429698,9.144792548687553,9.0459569517161142,9.8747865680136595]
[{"$f":"Id!D42","v":"R04"},{"$f":"Id!F42","v":"ULS Norte Alentejano"},"I10","Proporção de Crianças com Baixo Peso à Nascença","I10R04",{"$f":"IF($C$7=\"\",\"\",VLOOKUP($E7,BaseTrienal,F$10,FALSE))","v":7.6258104353195426},8.1510338627509746,8.293838862559241,8.2733812949640289,7.5757575757575761,7.2211476466795617,6.7301378857518053,7.1834279986635483,7.6352067868504774,7.9562594268476614,7.5323656335817972,7.4893286767559175,7.883971736705095,8.4269662921348321,8.1194944465721957,8.5542168674698793,8.3333333333333321,8.1329252295583725,7.3707865168539328]
[{"$f":"Id!D43","v":"R05"},{"$f":"Id!F43","v":"ULS Baixo Alentejo"},"I10","Proporção de Crianças com Baixo Peso à Nascença","I10R05",{"$f":"IF($C$8=\"\",\"\",VLOOKUP($E8,BaseTrienal,F$10,FALSE))","v":6.2094270392322892},6.7768132175861098,7.6923076923076925,7.7297452046951047,7.2422607213859695,6.2951198382904998,6.6685584562996603,6.9139966273187179,7.4247296112247883,7.6576576576576567,8.3828589302471066,8.9468779123951538,9.6734059097978236,9.1914087176247641,8.5099652008857962,8.2804674457429055,7.7503429355281206,8.2323592302209558,8.4337349397590362]
[{"$f":"Id!D44","v":"R06"},{"$f":"Id!F44","v":"ULS Litoral Alentejano"},"I10","Proporção de Crianças com Baixo Peso à Nascença","I10R06",{"$f":"IF($C$9=\"\",\"\",VLOOKUP($E9,BaseTrienal,F$10,FALSE))","v":7.1273359408952626},6.8257956448911221,7.1339693073413519,7.2373862696443343,7.8052874527906004,7.7496891835888944,8.2329317269076299,8.1081081081081088,8.9263677498971621,8.6675291073738681,8.8197146562905324,8.2837723024638912,8.6079077429983517,8.7898609975470148,8.5702513391017714,8.7263111502864703,8.7542087542087543,10.049751243781095,9.1897233201581017]
[null,null,null,null,null,23,24,25,26,27,28,29,30,31,32,33,34,35,36,37,38,39,40,41]
[3,"AnInd_ACeS",{"$f":"IF(AnInd_ACeS=1,\"\",VLOOKUP(AnInd_ACeS,AnACeS_tab,2,FALSE))","v":"R04"},{"$f":"IF(AnInd_ACeS=1,\"\",VLOOKUP(AnInd_ACeS,AnACeS_tab,3,FALSE))","v":"ULS Norte Alentejano"},{"$f":"IF(AnInd_codACeS=\"\",\"\",VLOOKUP(AnInd_codACeS,AnInd_TabTrienios,5,FALSE))","v":"I10R04"},{"$f":"IF(AnInd_codACeS=\"\",\"\",VLOOKUP(AnInd_codACeS,AnInd_TabTrienios,6,FALSE))","v":7.6258104353195426},{"$f":"IF(AnInd_codACeS=\"\",\"\",VLOOKUP(AnInd_codACeS,AnInd_TabTrienios,7,FALSE))","v":8.1510338627509746},{"$f":"IF(AnInd_codACeS=\"\",\"\",VLOOKUP(AnInd_codACeS,AnInd_TabTrienios,8,FALSE))","v":8.293838862559241},{"$f":"IF(AnInd_codACeS=\"\",\"\",VLOOKUP(AnInd_codACeS,AnInd_TabTrienios,9,FALSE))","v":8.2733812949640289},{"$f":"IF(AnInd_codACeS=\"\",\"\",VLOOKUP(AnInd_codACeS,AnInd_TabTrienios,10,FALSE))","v":7.5757575757575761},{"$f":"IF(AnInd_codACeS=\"\",\"\",VLOOKUP(AnInd_codACeS,AnInd_TabTrienios,11,FALSE))","v":7.2211476466795617},{"$f":"IF(AnInd_codACeS=\"\",\"\",VLOOKUP(AnInd_codACeS,AnInd_TabTrienios,12,FALSE))","v":6.7301378857518053},{"$f":"IF(AnInd_codACeS=\"\",\"\",VLOOKUP(AnInd_codACeS,AnInd_TabTrienios,13,FALSE))","v":7.1834279986635483},{"$f":"IF(AnInd_codACeS=\"\",\"\",VLOOKUP(AnInd_codACeS,AnInd_TabTrienios,14,FALSE))","v":7.6352067868504774},{"$f":"IF(AnInd_codACeS=\"\",\"\",VLOOKUP(AnInd_codACeS,AnInd_TabTrienios,15,FALSE))","v":7.9562594268476614},{"$f":"IF(AnInd_codACeS=\"\",\"\",VLOOKUP(AnInd_codACeS,AnInd_TabTrienios,16,FALSE))","v":7.5323656335817972},{"$f":"IF(AnInd_codACeS=\"\",\"\",VLOOKUP(AnInd_codACeS,AnInd_TabTrienios,17,FALSE))","v":7.4893286767559175},{"$f":"IF(AnInd_codACeS=\"\",\"\",VLOOKUP(AnInd_codACeS,AnInd_TabTrienios,18,FALSE))","v":7.883971736705095},{"$f":"IF(AnInd_codACeS=\"\",\"\",VLOOKUP(AnInd_codACeS,AnInd_TabTrienios,19,FALSE))","v":8.4269662921348321},{"$f":"IF(AnInd_codACeS=\"\",\"\",VLOOKUP(AnInd_codACeS,AnInd_TabTrienios,20,FALSE))","v":8.1194944465721957},{"$f":"IF(AnInd_codACeS=\"\",\"\",VLOOKUP(AnInd_codACeS,AnInd_TabTrienios,21,FALSE))","v":8.5542168674698793},{"$f":"IF(AnInd_codACeS=\"\",\"\",VLOOKUP(AnInd_codACeS,AnInd_TabTrienios,22,FALSE))","v":8.3333333333333321},{"$f":"IF(AnInd_codACeS=\"\",\"\",VLOOKUP(AnInd_codACeS,AnInd_TabTrienios,23,FALSE))","v":8.1329252295583725},{"$f":"IF(AnInd_codACeS=\"\",\"\",VLOOKUP(AnInd_codACeS,AnInd_TabTrienios,24,FALSE))","v":7.3707865168539328}]
[]
[19,"AnInd_Trienio",{"$f":"VLOOKUP(AnInd_TrienioSelect,AnIdTrienios,3,FALSE)","v":"2014-2016"},{"$f":"VLOOKUP(AnInd_TrienioSelect,AnIdTrienios,4,FALSE)","v":"14-16"}]
[]
[1,{"$f":"IF(E15=\"\",\"\",IF(E15<>0,RANK(E15,$E$15:$E$20,0),RANK(E15,$E$15:$E$20,0)+COUNTIF($E14:E$15,0)))","v":4},{"$f":"Id!E39","v":"CT"},{"$f":"Id!F39","v":"Continente"},{"$f":"IF(OR($D$13=\"\",HLOOKUP($D$13,$F$3:$X$9,A15+1,FALSE)=\"na\"),\"\",HLOOKUP($D$13,$F$3:$X$9,A15+1,FALSE))","v":8.7618348865870601},null,"OrdCT",{"$f":"IF(B15=\"\",\"\",B15)","v":4}]
[2,{"$f":"IF(E16=\"\",\"\",IF(E16<>0,RANK(E16,$E$15:$E$20,0),RANK(E16,$E$15:$E$20,0)+COUNTIF($E$15:E15,0)))","v":3},{"$f":"Id!E40","v":"RA"},{"$f":"Id!F40","v":"Região Alentejo"},{"$f":"IF(OR($D$13=\"\",HLOOKUP($D$13,$F$3:$X$9,A16+1,FALSE)=\"na\"),\"\",HLOOKUP($D$13,$F$3:$X$9,A16+1,FALSE))","v":8.8301462317210344},null,"OrdRN",{"$f":"IF(B16=\"\",\"\",B16)","v":3}]
[3,{"$f":"IF(E17=\"\",\"\",IF(E17<>0,RANK(E17,$E$15:$E$20,0),RANK(E17,$E$15:$E$20,0)+COUNTIF($E$15:E16,0)))","v":1},{"$f":"Id!E41","v":"A401"},{"$f":"Id!F41","v":"ACeS Alentejo Central"},9.8747865680136595,null,"OrdACeS",{"$f":"VLOOKUP(AnInd_ACeS+1,A15:B20,2,FALSE)","v":6},null,null,{"$f":"IF($B17=\"\",\"\",IF(AND($B17<$B$15,$B17<$B$16),$B17,IF(AND($B17<$B$15,$B17>$B$16),$B17-1,IF(AND($B17<$B$16,$B17>$B$15),$B17-1,$B17-2))))","v":1},{"$f":"IF($B17=\"\",\"\",IF(E17<$G$31,1,IF(E17<$G$32,2,IF(E17<$G$33,3,4))))","v":4}]
[4,{"$f":"IF(E18=\"\",\"\",IF(E18<>0,RANK(E18,$E$15:$E$20,0),RANK(E18,$E$15:$E$20,0)+COUNTIF($E$15:E17,0)))","v":6},{"$f":"Id!E42","v":"A402"},{"$f":"Id!F42","v":"ULS Norte Alentejano"},7.3707865168539328,null,null,null,null,null,{"$f":"IF($B18=\"\",\"\",IF(AND($B18<$B$15,$B18<$B$16),$B18,IF(AND($B18<$B$15,$B18>$B$16),$B18-1,IF(AND($B18<$B$16,$B18>$B$15),$B18-1,$B18-2))))","v":4},{"$f":"IF($B18=\"\",\"\",IF(E18<$G$31,1,IF(E18<$G$32,2,IF(E18<$G$33,3,4))))","v":1}]
[5,{"$f":"IF(E19=\"\",\"\",IF(E19<>0,RANK(E19,$E$15:$E$20,0),RANK(E19,$E$15:$E$20,0)+COUNTIF($E$15:E18,0)))","v":5},{"$f":"Id!E43","v":"A403"},{"$f":"Id!F43","v":"ULS Baixo Alentejo"},8.4337349397590362,null,"Zeros",{"$f":"COUNTIF(E15:E20,0)","v":0},null,null,3,{"$f":"IF($B19=\"\",\"\",IF(E19<$G$31,1,IF(E19<$G$32,2,IF(E19<$G$33,3,4))))","v":2}]
[6,{"$f":"IF(E20=\"\",\"\",IF(E20<>0,RANK(E20,$E$15:$E$20,0),RANK(E20,$E$15:$E$20,0)+COUNTIF($E$15:E19,0)))","v":2},{"$f":"Id!E44","v":"A404"},{"$f":"Id!F44","v":"ULS Litoral Alentejano"},9.1897233201581017,null,null,null,null,null,2,{"$f":"IF($B20=\"\",\"\",IF(E20<$G$31,1,IF(E20<$G$32,2,IF(E20<$G$33,3,4))))","v":3}]
[]
[{"$f":"IF(E15=\"\",\"\",VLOOKUP($A15,$B$15:$E$20,2,FALSE))","v":"A401"},{"$f":"IF(E15=\"\",\"\",VLOOKUP($A15,$B$15:$E$20,3,FALSE))","v":"ACeS Alentejo Central"},{"$f":"IF(E15=\"\",\"\",VLOOKUP($A15,$B$15:$E$20,4,FALSE))","v":9.8747865680136595},{"$f":"IF(A22=\"\",\"\",CONCATENATE(B22,\" (\",A22,\")\"))","v":"ACeS Alentejo Central (A401)"}]
["A404","ULS Litoral Alentejano",9.1897233201581017,{"$f":"IF(A23=\"\",\"\",CONCATENATE(B23,\" (\",A23,\")\"))","v":"ULS Litoral Alentejano (A404)"}]
["RA","Região Alentejo",8.8301462317210344,"Região Alentejo (RA)"]
["CT","Continente",8.7618348865870601,"Continente (CT)"]
["A403","ULS Baixo Alentejo",8.4337349397590362,"ULS Baixo Alentejo (A403)"]
["A402","ULS Norte Alentejano",7.3707865168539328,"ULS Norte Alentejano (A402)"]
[]
["Ord","Nº","ACeS",null,null,null,0,0,"classe0"]
[{"$f":"IF(D30=\"\",\"\",RANK(D30,$D$30:$D$51,1))","v":4},2,"A401",{"$f":"IF(E17=\"\",\"\",E17)","v":9.8747865680136595},null,null,{"$f":"IF($D$30=\"\",\"\",VLOOKUP(1,$A$30:$D$33,4,FALSE))","v":7.3707865168539328},null,"classe1",{"$f":"IF(G30=\"\",\"\",ROUND(G30,2))","v":7.37}]
[1,3,"A402",{"$f":"IF(E18=\"\",\"\",E18)","v":7.3707865168539328},null,null,{"$f":"IF($D$30=\"\",\"\",VLOOKUP(2,$A$30:$D$33,4,FALSE))","v":8.4337349397590362},null,"classe2",{"$f":"IF(G31=\"\",\"\",ROUND(G31,2))","v":8.43}]
[2,4,"A403",{"$f":"IF(E19=\"\",\"\",E19)","v":8.4337349397590362},null,null,{"$f":"IF($D$30=\"\",\"\",VLOOKUP(3,$A$30:$D$33,4,FALSE))","v":9.1897233201581017},null,"classe3",9.19]
[3,5,"A404",{"$f":"IF(E20=\"\",\"\",E20)","v":9.1897233201581017},null,null,{"$f":"IF($D$30=\"\",\"\",VLOOKUP(4,$A$30:$D$33,4,FALSE))","v":9.8747865680136595},null,"classe4",9.8699999999999992]
[]
[null,null,null,null,null,"ACeS Activo","A402","ACeSAct"]
[null,null,null,null,null,"Valor",{"$f":"IF(D30=\"\",0,VLOOKUP(ACeSAct,DadosMapear,2,FALSE))","v":7.3707865168539328},"ACeSActValor"]
[null,null,null,null,null,"Código",{"$f":"VLOOKUP(ACeSActValor,classeValores,3,TRUE)","v":"classe1"},"ACeSActCod"]
[]
[]
[]
[]
[]
[]
[]
[]
[]
[]
[]
[]
[]
[]
[null,"ACeS_Select",{"$f":"IF(AnInd_codACeS=\"\",\"\",VLOOKUP(AnInd_codACeS,Id!$D$39:$G$44,4,FALSE))","v":"A402"}]
[]
[null,"Legenda"]
[null,{"$f":"IF(TipoAn=\"T\",D2 & \" \" & E2 & \", 1996-2014 \" & F2,\"\")","v":"PROPORÇÃO DE CRIANÇAS COM BAIXO PESO À NASCENÇA (%), 1996-2014 (MÉDIA ANUAL POR TRIÉNIOS)"}]
[null,{"$f":"IF(TipoAn=\"T\",D2 & \" \" & E2 & \", MÉDIA ANUAL NO TRIÉNIO \" & C13,\"\")","v":"PROPORÇÃO DE CRIANÇAS COM BAIXO PESO À NASCENÇA (%), MÉDIA ANUAL NO TRIÉNIO 2014-2016"}]
[null,{"$f":"IF(TipoAn=\"T\",D2 & \" \" & E2 & \", \" & C13,\"\")","v":"PROPORÇÃO DE CRIANÇAS COM BAIXO PESO À NASCENÇA (%), 2014-2016"}]

{"sheet":"AnInd_baseA","index":12,"n_rows":56,"n_cols":26,"rows_kept":56,"cut":false,"hidden":true,"merged":[]}
[]
[]
["Rcod","Local_Residencia","Icod","Indicador","cod_IndRes",1996,1997,1998,1999,2000,2001,2002,2003,2004,2005,2006,2007,2008,2009,2010,2011,2012,2013,2014,2015,2016]
[{"$f":"Id!D39","v":"R01"},{"$f":"Id!F39","v":"Continente"},{"$f":"IF(TipoAn=\"A\",AnInd_baseT!$C$1,\"\")","v":""},{"$f":"IF(TipoAn=\"A\",AnInd_baseT!$D$1,\"\")","v":""},{"$f":"IF(C4=\"\",\"\",CONCATENATE(C4,A4))","v":""},{"$f":"IF($C$4=\"\",\"\",VLOOKUP($E4,BaseAnual,F$10,FALSE))","v":""},"","","","","","","","","","","","","","","","","","","",""]
[{"$f":"Id!D40","v":"R02"},{"$f":"Id!F40","v":"Região Alentejo"},{"$f":"IF(TipoAn=\"A\",AnInd_baseT!$C$1,\"\")","v":""},{"$f":"IF(TipoAn=\"A\",AnInd_baseT!$D$1,\"\")","v":""},{"$f":"IF(C5=\"\",\"\",CONCATENATE(C5,A5))","v":""},{"$f":"IF($C$5=\"\",\"\",VLOOKUP($E5,BaseAnual,F$10,FALSE))","v":""},"","","","","","","","","","","","","","","","","","","",""]
[{"$f":"Id!D41","v":"R03"},{"$f":"Id!F41","v":"ACeS Alentejo Central"},{"$f":"IF(TipoAn=\"A\",AnInd_baseT!$C$1,\"\")","v":""},{"$f":"IF(TipoAn=\"A\",AnInd_baseT!$D$1,\"\")","v":""},"",{"$f":"IF($C$6=\"\",\"\",VLOOKUP($E6,BaseAnual,F$10,FALSE))","v":""},"","","","","","","","","","","","","","","","","","","",""]
[{"$f":"Id!D42","v":"R04"},{"$f":"Id!F42","v":"ULS Norte Alentejano"},{"$f":"IF(TipoAn=\"A\",AnInd_baseT!$C$1,\"\")","v":""},{"$f":"IF(TipoAn=\"A\",AnInd_baseT!$D$1,\"\")","v":""},"",{"$f":"IF($C$7=\"\",\"\",VLOOKUP($E7,BaseAnual,F$10,FALSE))","v":""},"","","","","","","","","","","","","","","","","","","",""]
[{"$f":"Id!D43","v":"R05"},{"$f":"Id!F43","v":"ULS Baixo Alentejo"},{"$f":"IF(TipoAn=\"A\",AnInd_baseT!$C$1,\"\")","v":""},{"$f":"IF(TipoAn=\"A\",AnInd_baseT!$D$1,\"\")","v":""},"",{"$f":"IF($C$8=\"\",\"\",VLOOKUP($E8,BaseAnual,F$10,FALSE))","v":""},"","","","","","","","","","","","","","","","","","","",""]
[{"$f":"Id!D44","v":"R06"},{"$f":"Id!F44","v":"ULS Litoral Alentejano"},{"$f":"IF(TipoAn=\"A\",AnInd_baseT!$C$1,\"\")","v":""},{"$f":"IF(TipoAn=\"A\",AnInd_baseT!$D$1,\"\")","v":""},"",{"$f":"IF($C$9=\"\",\"\",VLOOKUP($E9,BaseAnual,F$10,FALSE))","v":""},"","","","","","","","","","","","","","","","","","","",""]
[null,null,null,null,null,2,3,4,5,6,7,8,9,10,11,12,13,14,15,16,17,18,19,20,21,22]
[3,{"$f":"AnInd_baseT!B11","v":"AnInd_ACeS"},{"$f":"AnInd_codACeS","v":"R04"},{"$f":"AnInd_baseT!D11","v":"ULS Norte Alentejano"},{"$f":"IF(AnInd_codACeS=\"\",\"\",VLOOKUP(AnInd_codACeS,AnInd_TabAnual,5,FALSE))","v":""},{"$f":"IF(AnInd_codACeS=\"\",\"\",VLOOKUP(AnInd_codACeS,AnInd_TabAnual,6,FALSE))","v":""},{"$f":"IF(AnInd_codACeS=\"\",\"\",VLOOKUP(AnInd_codACeS,AnInd_TabAnual,7,FALSE))","v":""},{"$f":"IF(AnInd_codACeS=\"\",\"\",VLOOKUP(AnInd_codACeS,AnInd_TabAnual,8,FALSE))","v":""},{"$f":"IF(AnInd_codACeS=\"\",\"\",VLOOKUP(AnInd_codACeS,AnInd_TabAnual,9,FALSE))","v":""},{"$f":"IF(AnInd_codACeS=\"\",\"\",VLOOKUP(AnInd_codACeS,AnInd_TabAnual,10,FALSE))","v":""},{"$f":"IF(AnInd_codACeS=\"\",\"\",VLOOKUP(AnInd_codACeS,AnInd_TabAnual,11,FALSE))","v":""},{"$f":"IF(AnInd_codACeS=\"\",\"\",VLOOKUP(AnInd_codACeS,AnInd_TabAnual,12,FALSE))","v":""},{"$f":"IF(AnInd_codACeS=\"\",\"\",VLOOKUP(AnInd_codACeS,AnInd_TabAnual,13,FALSE))","v":""},{"$f":"IF(AnInd_codACeS=\"\",\"\",VLOOKUP(AnInd_codACeS,AnInd_TabAnual,14,FALSE))","v":""},{"$f":"IF(AnInd_codACeS=\"\",\"\",VLOOKUP(AnInd_codACeS,AnInd_TabAnual,15,FALSE))","v":""},{"$f":"IF(AnInd_codACeS=\"\",\"\",VLOOKUP(AnInd_codACeS,AnInd_TabAnual,16,FALSE))","v":""},{"$f":"IF(AnInd_codACeS=\"\",\"\",VLOOKUP(AnInd_codACeS,AnInd_TabAnual,17,FALSE))","v":""},{"$f":"IF(AnInd_codACeS=\"\",\"\",VLOOKUP(AnInd_codACeS,AnInd_TabAnual,18,FALSE))","v":""},{"$f":"IF(AnInd_codACeS=\"\",\"\",VLOOKUP(AnInd_codACeS,AnInd_TabAnual,19,FALSE))","v":""},{"$f":"IF(AnInd_codACeS=\"\",\"\",VLOOKUP(AnInd_codACeS,AnInd_TabAnual,20,FALSE))","v":""},{"$f":"IF(AnInd_codACeS=\"\",\"\",VLOOKUP(AnInd_codACeS,AnInd_TabAnual,21,FALSE))","v":""},{"$f":"IF(AnInd_codACeS=\"\",\"\",VLOOKUP(AnInd_codACeS,AnInd_TabAnual,22,FALSE))","v":""},{"$f":"IF(AnInd_codACeS=\"\",\"\",VLOOKUP(AnInd_codACeS,AnInd_TabAnual,23,FALSE))","v":""},{"$f":"IF(AnInd_codACeS=\"\",\"\",VLOOKUP(AnInd_codACeS,AnInd_TabAnual,24,FALSE))","v":""},{"$f":"IF(AnInd_codACeS=\"\",\"\",VLOOKUP(AnInd_codACeS,AnInd_TabAnual,24,FALSE))","v":""},{"$f":"IF(AnInd_codACeS=\"\",\"\",VLOOKUP(AnInd_codACeS,AnInd_TabAnual,25,FALSE))","v":""}]
[]
[21,"AnInd_Ano",{"$f":"VLOOKUP(AnInd_AnoSelect,AnIdAnos,4,FALSE)","v":2016},{"$f":"VLOOKUP(AnInd_AnoSelect,AnIdAnos,5,FALSE)","v":16}]
[]
[1,{"$f":"IF(E15=\"\",\"\",RANK(E15,$E$15:$E$20,0))","v":""},{"$f":"Id!E39","v":"CT"},{"$f":"Id!F39","v":"Continente"},{"$f":"IF($C$4=\"\",\"\",HLOOKUP($C$13,$F$3:$Z$9,A15+1,FALSE))","v":""},null,"OrdCTA",{"$f":"IF(B15=\"\",\"\",B15)","v":""}]
[2,"",{"$f":"Id!E40","v":"RA"},{"$f":"Id!F40","v":"Região Alentejo"},{"$f":"IF($C$4=\"\",\"\",HLOOKUP($C$13,$F$3:$Z$9,A16+1,FALSE))","v":""},null,"OrdRNA",{"$f":"IF(B16=\"\",\"\",B16)","v":""}]
[3,"",{"$f":"Id!E41","v":"A401"},{"$f":"Id!F41","v":"ACeS Alentejo Central"},{"$f":"IF($C$4=\"\",\"\",HLOOKUP($C$13,$F$3:$Z$9,A17+1,FALSE))","v":""},null,"OrdACeSA",{"$f":"VLOOKUP(AnInd_ACeS+1,A15:B20,2,FALSE)","v":""},null,null,{"$f":"IF($B17=\"\",\"\",IF(AND($B17<$B$15,$B17<$B$16),$B17,IF(AND($B17<$B$15,$B17>$B$16),$B17-1,IF(AND($B17<$B$16,$B17>$B$15),$B17-1,$B17-2))))","v":""},{"$f":"IF($B17=\"\",\"\",IF(E17<$G$32,1,IF(E17<$G$33,2,IF(E17<$G$34,3,4))))","v":""}]
[4,"",{"$f":"Id!E42","v":"A402"},{"$f":"Id!F42","v":"ULS Norte Alentejano"},"",null,null,null,null,null,{"$f":"IF($B18=\"\",\"\",IF(AND($B18<$B$15,$B18<$B$16),$B18,IF(AND($B18<$B$15,$B18>$B$16),$B18-1,IF(AND($B18<$B$16,$B18>$B$15),$B18-1,$B18-2))))","v":""},{"$f":"IF($B18=\"\",\"\",IF(E18<$G$32,1,IF(E18<$G$33,2,IF(E18<$G$34,3,4))))","v":""}]
[5,"",{"$f":"Id!E43","v":"A403"},{"$f":"Id!F43","v":"ULS Baixo Alentejo"},"",null,null,null,null,null,"",{"$f":"IF($B19=\"\",\"\",IF(E19<$G$32,1,IF(E19<$G$33,2,IF(E19<$G$34,3,4))))","v":""}]
[6,"",{"$f":"Id!E44","v":"A404"},{"$f":"Id!F44","v":"ULS Litoral Alentejano"},"",null,null,null,null,null,"",{"$f":"IF($B20=\"\",\"\",IF(E20<$G$32,1,IF(E20<$G$33,2,IF(E20<$G$34,3,4))))","v":""}]
[]
[{"$f":"IF(E15=\"\",\"\",VLOOKUP($A15,$B$15:$E$20,2,FALSE))","v":""},{"$f":"IF(E15=\"\",\"\",VLOOKUP($A15,$B$15:$E$20,3,FALSE))","v":""},{"$f":"IF(E15=\"\",\"\",VLOOKUP($A15,$B$15:$E$20,4,FALSE))","v":""},{"$f":"IF(A22=\"\",\"\",CONCATENATE(B22,\" (\",A22,\")\"))","v":""}]
["","","",{"$f":"IF(A23=\"\",\"\",CONCATENATE(B23,\" (\",A23,\")\"))","v":""}]
["","","",""]
["","","",""]
["","","",""]
["","","",""]
[]
["Ord","Nº","ACeS"]
[{"$f":"IF(D30=\"\",\"\",RANK(D30,$D$30:$D$51,1))","v":""},2,"A401",{"$f":"IF(E17=\"\",\"\",E17)","v":""},null,null,0,0,"classeA0"]
["",3,"A402",{"$f":"IF(E18=\"\",\"\",E18)","v":""},null,null,{"$f":"IF($D$30=\"\",\"\",VLOOKUP(1,$A$30:$D$33,4,FALSE))","v":""},null,"classeA1",null,{"$f":"IF(G31=\"\",\"\",ROUND(G31,2))","v":""}]
["",4,"A403",{"$f":"IF(E19=\"\",\"\",E19)","v":""},null,null,{"$f":"IF($D$30=\"\",\"\",VLOOKUP(2,$A$30:$D$33,4,FALSE))","v":""},null,"classeA2",null,{"$f":"IF(G32=\"\",\"\",ROUND(G32,2))","v":""}]
["",5,"A404",{"$f":"IF(E20=\"\",\"\",E20)","v":""},null,null,{"$f":"IF($D$30=\"\",\"\",VLOOKUP(3,$A$30:$D$33,4,FALSE))","v":""},null,"classeA3",null,""]
[null,null,null,null,null,null,{"$f":"IF($D$30=\"\",\"\",VLOOKUP(4,$A$30:$D$33,4,FALSE))","v":""},null,"classeA4",null,""]
[]
[null,null,null,null,null,"ACeS Activo","A401","ACeSActA"]
[null,null,null,null,null,"Valor",{"$f":"IF(D30=\"\",0,VLOOKUP(ACeSActA,DadosMapearA,2,FALSE))","v":0},"ACeSActValorA"]
[null,null,null,null,null,"Código",{"$f":"VLOOKUP(ACeSActValorA,classeValoresA,3,TRUE)","v":"classeA0"},"ACeSActCodA"]
[]
[]
[]
[]
[]
[]
[]
[]
[]
[]
[]
[]
[]
[null,"ACeS_Select",{"$f":"IF(AnInd_codACeS=\"\",\"\",VLOOKUP(AnInd_codACeS,Id!$D$39:$G$44,4,FALSE))","v":"A402"}]
[]
[null,"Legenda"]
[null,{"$f":"IF(TipoAn=\"A\",AnInd_baseT!D2 & \" \" & AnInd_baseT!E2 & \", 1996-2015 \" & AnInd_baseT!F2,\"\")","v":""}]
[null,{"$f":"IF(TipoAn=\"A\",AnInd_baseT!D2 & \" \" & AnInd_baseT!E2 & \", \" & C13,\"\")","v":""}]

{"sheet":"AnR","index":13,"n_rows":40,"n_cols":10,"rows_kept":40,"cut":false,"hidden":false,"merged":[[1,1,1,11],[3,1,3,11],[5,1,5,5],[7,1,7,2],[5,6,6,9],[7,3,7,5],[38,9,38,10],[41,1,41,11],[10,1,10,11],[39,1,39,5],[12,1,12,11],[34,8,34,11],[32,8,32,9],[33,8,33,11],[35,9,35,10],[36,9,36,10],[37,9,37,10],[38,1,38,5],[20,1,20,5]]}
[]
[null,"mort@lidades.infantil"]
[]
[null,"Análise da Razão R por Indicador"]
[]
[null,"Selecione o Indicador",null,null,null,null,"Selecione a Referência"]
[]
[null,"Selecione o ACeS",null,"Selecione o Quinquénio"]
[]
[]
[null,{"$f":"AnR_base!D1","v":"Nascimentos Pré-termo"}]
[]
[null,{"$f":"AnR_base!B73","v":"NASCIMENTOS PRÉ-TERMO, QUINQUÉNIO 1996-2000"}]
[null,null,"O","E","R",{"$f":"AnR_base!D36","v":"I.C. (95%)"}]
[null,{"$f":"AnR_base!B29","v":"Região Alentejo"},{"$f":"IF(AnR_base!F29=0,\"\",AnR_base!F29)","v":""}]
[null,{"$f":"AnR_base!L41","v":""},{"$f":"AnR_base!F41","v":""},{"$f":"AnR_base!G41","v":""},{"$f":"AnR_base!H41","v":""},{"$f":"AnR_base!K41","v":""},{"$f":"AnR_base!D41","v":""}]
[null,{"$f":"AnR_base!L42","v":""},{"$f":"AnR_base!F42","v":""},{"$f":"AnR_base!G42","v":""},{"$f":"AnR_base!H42","v":""},{"$f":"AnR_base!K42","v":""},{"$f":"AnR_base!D42","v":""}]
[null,{"$f":"AnR_base!L43","v":""},{"$f":"AnR_base!F43","v":""},{"$f":"AnR_base!G43","v":""},{"$f":"AnR_base!H43","v":""},{"$f":"AnR_base!K43","v":""},{"$f":"AnR_base!D43","v":""}]
[null,{"$f":"AnR_base!L44","v":""},{"$f":"AnR_base!F44","v":""},{"$f":"AnR_base!G44","v":""},{"$f":"AnR_base!H44","v":""},{"$f":"AnR_base!K44","v":""},{"$f":"AnR_base!D44","v":""}]
[]
[null,{"$f":"AnR_base!B75","v":"Comparação com Região Alentejo, R=100"}]
[]
[]
[]
[]
[]
[]
[]
[]
[]
[]
[]
[null,null,null,null,null,null,null,null,"Legenda"]
[null,null,null,null,null,null,null,null,{"$f":"AnR_base!B73","v":"NASCIMENTOS PRÉ-TERMO, QUINQUÉNIO 1996-2000"}]
[null,null,null,null,null,null,null,null,{"$f":"AnR_base!B74","v":"Comparação com Região Alentejo, I.C. (95%)"}]
[null,null,null,null,null,null,null,null,null,"R diminuída e significativa"]
[null,null,null,null,null,null,null,null,null,"R diminuída, mas não significativa"]
[null,null,null,null,null,null,null,null,null,"R aumentada, mas não significativa"]
[null,null,null,null,null,null,null,null,null,"R aumentadada e significativa"]
[null,null,null,null,null,null,""]

{"sheet":"AnR_base","index":14,"n_rows":75,"n_cols":18,"rows_kept":75,"cut":false,"hidden":true,"merged":[]}
[4,"AnR_IndSelect",{"$f":"IF(AnR_IndSelect=1,\"\",VLOOKUP(AnR_IndSelect,AnR_tabId,2,FALSE))","v":"I07"},{"$f":"IF(AnR_IndSelect=1,\"\",VLOOKUP(AnR_IndSelect,AnR_tabId,3,FALSE))","v":"Nascimentos Pré-termo"}]
[null,null,null,{"$f":"IF(AnR_IndSelect=1,\"\",VLOOKUP(AnR_IndSelect,AnR_tabIdLeg,4,FALSE))","v":"NASCIMENTOS PRÉ-TERMO"}]
["Rcod","Local_Residencia","Icod","Indicador","cod_IndRes","96-00","01-05","06-10","11-15","12-16"]
[{"$f":"Id!D39","v":"R01"},{"$f":"Id!F39","v":"Continente"},{"$f":"IF($C$1=\"\",\"\",$C$1)","v":"I07"},{"$f":"IF($C$1=\"\",\"\",$D$1)","v":"Nascimentos Pré-termo"},{"$f":"IF(C4=\"\",\"\",CONCATENATE(C4,A4))","v":"I07R01"},{"$f":"IF(C4=\"\",\"\",VLOOKUP($E4,BaseQuinquenal,40,FALSE))","v":0},{"$f":"IF(C4=\"\",\"\",VLOOKUP($E4,BaseQuinquenal,41,FALSE))","v":0},{"$f":"IF(C4=\"\",\"\",VLOOKUP($E4,BaseQuinquenal,42,FALSE))","v":0},{"$f":"IF(C4=\"\",\"\",VLOOKUP($E4,BaseQuinquenal,43,FALSE))","v":34253},{"$f":"IF(C4=\"\",\"\",VLOOKUP($E4,BaseQuinquenal,44,FALSE))","v":41364}]
[{"$f":"Id!D40","v":"R02"},{"$f":"Id!F40","v":"Região Alentejo"},{"$f":"IF($C$1=\"\",\"\",$C$1)","v":"I07"},{"$f":"IF($C$1=\"\",\"\",$D$1)","v":"Nascimentos Pré-termo"},{"$f":"IF(C5=\"\",\"\",CONCATENATE(C5,A5))","v":"I07R02"},0,{"$f":"IF(C5=\"\",\"\",VLOOKUP($E5,BaseQuinquenal,41,FALSE))","v":0},{"$f":"IF(C5=\"\",\"\",VLOOKUP($E5,BaseQuinquenal,42,FALSE))","v":0},{"$f":"IF(C5=\"\",\"\",VLOOKUP($E5,BaseQuinquenal,43,FALSE))","v":1501},1703]
[{"$f":"Id!D41","v":"R03"},{"$f":"Id!F41","v":"ACeS Alentejo Central"},"I07","Nascimentos Pré-termo","I07R03",0,0,0,525,550]
[{"$f":"Id!D42","v":"R04"},{"$f":"Id!F42","v":"ULS Norte Alentejano"},"I07","Nascimentos Pré-termo","I07R04",0,0,0,307,329]
[{"$f":"Id!D43","v":"R05"},{"$f":"Id!F43","v":"ULS Baixo Alentejo"},"I07","Nascimentos Pré-termo","I07R05",0,0,0,399,479]
[{"$f":"Id!D44","v":"R06"},{"$f":"Id!F44","v":"ULS Litoral Alentejano"},"I07","Nascimentos Pré-termo","I07R06",0,0,0,270,345]
[]
[{"$f":"IF(C1=\"\",\"\",IF(OR(C1=\"I22\",C1=\"I24\"),1,2))","v":2},"Denominador",{"$f":"IF(A11=\"\",\"\",IF(A11=1,\"I26\",\"I01\"))","v":"I01"},{"$f":"IF(A11=\"\",\"\",VLOOKUP(AnR_codDenom,Id!$D$7:$G$34,3,FALSE))","v":"Nados Vivos"}]
[]
["Rcod","Local_Residencia","Icod","Indicador","cod_IndRes","96-00","01-05","06-10","11-15","12-16","Quinq_Select"]
[{"$f":"Id!D39","v":"R01"},{"$f":"Id!F39","v":"Continente"},{"$f":"IF($C$11=\"\",\"\",$C$11)","v":"I01"},{"$f":"IF($A$11=\"\",\"\",AnR_IndDenom)","v":"Nados Vivos"},{"$f":"IF(C14=\"\",\"\",CONCATENATE(C14,A14))","v":"I01R01"},{"$f":"IF(C14=\"\",\"\",VLOOKUP($E14,BaseQuinquenal,40,FALSE))","v":0},{"$f":"IF($C14=\"\",\"\",VLOOKUP($E14,BaseQuinquenal,41,FALSE))","v":0},{"$f":"IF($C14=\"\",\"\",VLOOKUP($E14,BaseQuinquenal,42,FALSE))","v":539523},{"$f":"IF($C14=\"\",\"\",VLOOKUP($E14,BaseQuinquenal,43,FALSE))","v":527632},{"$f":"IF($C14=\"\",\"\",VLOOKUP($E14,BaseQuinquenal,44,FALSE))","v":486152},{"$f":"IF(AnRComp_codACeS=\"\",\"\",HLOOKUP($D$23,$F$13:$J$19,2,FALSE))","v":0}]
[{"$f":"Id!D40","v":"R02"},{"$f":"Id!F40","v":"Região Alentejo"},{"$f":"IF($C$11=\"\",\"\",$C$11)","v":"I01"},"Nados Vivos",{"$f":"IF(C15=\"\",\"\",CONCATENATE(C15,A15))","v":"I01R02"},{"$f":"IF(C15=\"\",\"\",VLOOKUP($E15,BaseQuinquenal,40,FALSE))","v":0},0,23185,22625,20472,{"$f":"IF(AnRComp_codACeS=\"\",\"\",HLOOKUP($D$23,$F$13:$J$19,3,FALSE))","v":0}]
[{"$f":"Id!D41","v":"R03"},{"$f":"Id!F41","v":"ACeS Alentejo Central"},{"$f":"IF($C$11=\"\",\"\",$C$11)","v":"I01"},"Nados Vivos","I01R03",{"$f":"IF(C16=\"\",\"\",VLOOKUP($E16,BaseQuinquenal,40,FALSE))","v":0},0,7796,7606,6857,{"$f":"IF(AnRComp_codACeS=\"\",\"\",HLOOKUP($D$23,$F$13:$J$19,4,FALSE))","v":0}]
[{"$f":"Id!D42","v":"R04"},{"$f":"Id!F42","v":"ULS Norte Alentejano"},{"$f":"IF($C$11=\"\",\"\",$C$11)","v":"I01"},"Nados Vivos","I01R04",{"$f":"IF($C$17=\"\",\"\",VLOOKUP($E17,BaseQuinquenal,40,FALSE))","v":0},0,5540,5080,4342,{"$f":"IF(AnRComp_codACeS=\"\",\"\",HLOOKUP($D$23,$F$13:$J$19,5,FALSE))","v":0}]
[{"$f":"Id!D43","v":"R05"},{"$f":"Id!F43","v":"ULS Baixo Alentejo"},"I01","Nados Vivos","I01R05",{"$f":"IF($C$18=\"\",\"\",VLOOKUP($E18,BaseQuinquenal,40,FALSE))","v":0},0,5915,5843,5347,{"$f":"IF(AnRComp_codACeS=\"\",\"\",HLOOKUP($D$23,$F$13:$J$19,6,FALSE))","v":0}]
[{"$f":"Id!D44","v":"R06"},{"$f":"Id!F44","v":"ULS Litoral Alentejano"},"I01","Nados Vivos","I01R06",{"$f":"IF($C$19=\"\",\"\",VLOOKUP($E19,BaseQuinquenal,40,FALSE))","v":0},0,3934,4096,3926,{"$f":"IF(AnRComp_codACeS=\"\",\"\",HLOOKUP($D$23,$F$13:$J$19,7,FALSE))","v":0}]
[]
[3,"AnR_ACeS",{"$f":"IF(AnR_ACeS=1,\"\",VLOOKUP(AnR_ACeS,AnACeS_tab,2,FALSE))","v":"R04"},{"$f":"IF(AnR_ACeS=1,\"\",VLOOKUP(AnR_ACeS,AnACeS_tab,3,FALSE))","v":"ULS Norte Alentejano"},{"$f":"IF(AnR_CodACeS=\"\",\"\",VLOOKUP(AnR_CodACeS,AnR_TabQuinq,5,FALSE))","v":"I07R04"},{"$f":"IF(AnR_CodACeS=\"\",\"\",VLOOKUP(AnR_CodACeS,AnR_TabQuinq,6,FALSE))","v":0},{"$f":"IF(AnR_CodACeS=\"\",\"\",VLOOKUP(AnR_CodACeS,AnR_TabQuinq,7,FALSE))","v":0},{"$f":"IF(AnR_CodACeS=\"\",\"\",VLOOKUP(AnR_CodACeS,AnR_TabQuinq,8,FALSE))","v":0}]
[]
[1,"AnR_Quinquenio",{"$f":"VLOOKUP(AnR_Quinquenio,AnR_IdQuinq,3,FALSE)","v":"1996-2000"},{"$f":"VLOOKUP(AnR_Quinquenio,AnR_IdQuinq,4,FALSE)","v":"96-00"}]
[null,null,null,null,null,"96-00","01-05","06-10","11-15","12-16","Quinq_Select"]
[2,"AnR_Comparador",{"$f":"IF(AnRComparador=1,A4,A5)","v":"R02"},{"$f":"IF(AnRComparador=1,B4,B5)","v":"Região Alentejo"},{"$f":"IF(AnRComp_codACeS=\"\",\"\",VLOOKUP(AnRComp_codACeS,AnR_TabQuinq,5,FALSE))","v":"I07R02"},{"$f":"IF(AnRComp_codACeS=\"\",\"\",VLOOKUP(AnRComp_codACeS,AnR_TabQuinq,6,FALSE))","v":0},{"$f":"IF(AnRComp_codACeS=\"\",\"\",VLOOKUP(AnRComp_codACeS,AnR_TabQuinq,7,FALSE))","v":0},{"$f":"IF(AnRComp_codACeS=\"\",\"\",VLOOKUP(AnRComp_codACeS,AnR_TabQuinq,8,FALSE))","v":0},{"$f":"IF(AnRComp_codACeS=\"\",\"\",VLOOKUP(AnRComp_codACeS,AnR_TabQuinq,9,FALSE))","v":1501},{"$f":"IF(AnRComp_codACeS=\"\",\"\",VLOOKUP(AnRComp_codACeS,AnR_TabQuinq,10,FALSE))","v":1703},{"$f":"IF(AnRComp_codACeS=\"\",\"\",HLOOKUP($D$23,$F$24:$J$26,2,FALSE))","v":0}]
[null,null,{"$f":"IF(AnRComparador=1,A14,A15)","v":"R02"},{"$f":"IF(AnRComparador=1,B14,B15)","v":"Região Alentejo"},{"$f":"IF(AnRComp_codACeS=\"\",\"\",VLOOKUP(AnRComp_codACeS,AnR_TabDenom,5,FALSE))","v":"I01R02"},{"$f":"IF(AnRComp_codACeS=\"\",\"\",VLOOKUP(AnRComp_codACeS,AnR_TabDenom,6,FALSE))","v":0},{"$f":"IF(AnRComp_codACeS=\"\",\"\",VLOOKUP(AnRComp_codACeS,AnR_TabDenom,7,FALSE))","v":0},{"$f":"IF(AnRComp_codACeS=\"\",\"\",VLOOKUP(AnRComp_codACeS,AnR_TabDenom,8,FALSE))","v":23185},{"$f":"IF(AnRComp_codACeS=\"\",\"\",VLOOKUP(AnRComp_codACeS,AnR_TabDenom,9,FALSE))","v":22625},{"$f":"IF(AnRComp_codACeS=\"\",\"\",VLOOKUP(AnRComp_codACeS,AnR_TabDenom,10,FALSE))","v":20472},{"$f":"IF(AnRComp_codACeS=\"\",\"\",HLOOKUP($D$23,$F$24:$J$26,3,FALSE))","v":0}]
[]
["Rcod","Local_Residencia","Icod","Indicador","cod_IndRes","O","E","R","IC_min",null,"Ic_max"]
[{"$f":"AnRComp_codACeS","v":"R02"},{"$f":"D25","v":"Região Alentejo"},{"$f":"IF($C$4=\"\",\"\",C5)","v":"I07"},"Nascimentos Pré-termo",{"$f":"IF(C29=\"\",\"\",CONCATENATE(C29,A29))","v":"I07R02"},{"$f":"IF(E29=\"\",\"\",K25)","v":0},null,null,null,null,null,null,null,null,null,null,null,"Map"]
[{"$f":"A6","v":"R03"},"ACeS Alentejo Central","I07","Nascimentos Pré-termo",{"$f":"IF(C30=\"\",\"\",CONCATENATE(C30,A30))","v":"I07R03"},{"$f":"IF(OR(E30=\"\",$F$29=0),\"\",HLOOKUP($D$23,$E$3:$J$9,4,FALSE))","v":""},{"$f":"IF(OR(E30=\"\",$F$29=0),\"\",$K$25/$K$26*$K16)","v":""},{"$f":"IF(OR(E30=\"\",$F$29=0),\"\",F30/G30)","v":""},{"$f":"IF(OR(E30=\"\",$F$29=0),\"\",IF(F30>100,(1-1/(9*F30)-$B$38/(3*SQRT(F30)))^3*F30/G30,IF(F30>0,CHIINV($B$37,2*F30)/2/G30,0)))","v":""},null,{"$f":"IF(OR(E30=\"\",$F$29=0),\"\",IF(F30>100,(1-1/(9*(F30+1))+$B$38/(3*SQRT(F30+1)))^3*(F30+1)/G30,IF(F30>0,CHIINV($B$36,2*(F30+1))/2/G30,CHIINV($B$36,2)/2/G30)))","v":""},null,1,{"$f":"IF(OR(E30=\"\",$F$29=0),\"\",RANK(H30,$H$30:$H$33,0))","v":""},{"$f":"IF(E30=\"\",\"\",Id!E41)","v":"A401"},{"$f":"IF(C30=\"\",\"\",B30)","v":"ACeS Alentejo Central"},{"$f":"IF(OR(E30=\"\",$F$29=0),\"\",E30)","v":""},{"$f":"IF(H30=\"\",\"\",IF(AND(H30<1,K30<1),2,IF(AND(H30>1,I30>1),-2,IF(AND(H30<1,K30>1),1,-1))))","v":""}]
["R04","ULS Norte Alentejano","I07","Nascimentos Pré-termo","I07R04",{"$f":"IF(OR(E31=\"\",$F$29=0),\"\",HLOOKUP($D$23,$E$3:$J$9,5,FALSE))","v":""},{"$f":"IF(OR(E31=\"\",$F$29=0),\"\",$K$25/$K$26*$K17)","v":""},{"$f":"IF(OR(E31=\"\",$F$29=0),\"\",F31/G31)","v":""},{"$f":"IF(OR(E31=\"\",$F$29=0),\"\",IF(F31>100,(1-1/(9*F31)-$B$38/(3*SQRT(F31)))^3*F31/G31,IF(F31>0,CHIINV($B$37,2*F31)/2/G31,0)))","v":""},null,{"$f":"IF(OR(E31=\"\",$F$29=0),\"\",IF(F31>100,(1-1/(9*(F31+1))+$B$38/(3*SQRT(F31+1)))^3*(F31+1)/G31,IF(F31>0,CHIINV($B$36,2*(F31+1))/2/G31,CHIINV($B$36,2)/2/G31)))","v":""},null,2,{"$f":"IF(OR(E31=\"\",$F$29=0),\"\",RANK(H31,$H$30:$H$33,0))","v":""},{"$f":"IF(E31=\"\",\"\",Id!E42)","v":"A402"},{"$f":"IF(C31=\"\",\"\",B31)","v":"ULS Norte Alentejano"},{"$f":"IF(OR(E31=\"\",$F$29=0),\"\",E31)","v":""},{"$f":"IF(H31=\"\",\"\",IF(AND(H31<1,K31<1),2,IF(AND(H31>1,I31>1),-2,IF(AND(H31<1,K31>1),1,-1))))","v":""}]
["R05","ULS Baixo Alentejo","I07","Nascimentos Pré-termo","I07R05",{"$f":"IF(OR(E32=\"\",$F$29=0),\"\",HLOOKUP($D$23,$E$3:$J$9,6,FALSE))","v":""},{"$f":"IF(OR(E32=\"\",$F$29=0),\"\",$K$25/$K$26*$K18)","v":""},"",{"$f":"IF(OR(E32=\"\",$F$29=0),\"\",IF(F32>100,(1-1/(9*F32)-$B$38/(3*SQRT(F32)))^3*F32/G32,IF(F32>0,CHIINV($B$37,2*F32)/2/G32,0)))","v":""},null,{"$f":"IF(OR(E32=\"\",$F$29=0),\"\",IF(F32>100,(1-1/(9*(F32+1))+$B$38/(3*SQRT(F32+1)))^3*(F32+1)/G32,IF(F32>0,CHIINV($B$36,2*(F32+1))/2/G32,CHIINV($B$36,2)/2/G32)))","v":""},null,3,{"$f":"IF(OR(E32=\"\",$F$29=0),\"\",RANK(H32,$H$30:$H$33,0))","v":""},{"$f":"IF(E32=\"\",\"\",Id!E43)","v":"A403"},"ULS Baixo Alentejo","",""]
["R06","ULS Litoral Alentejano","I07","Nascimentos Pré-termo","I07R06",{"$f":"IF(OR(E33=\"\",$F$29=0),\"\",HLOOKUP($D$23,$E$3:$J$9,7,FALSE))","v":""},{"$f":"IF(OR(E33=\"\",$F$29=0),\"\",$K$25/$K$26*$K19)","v":""},"",{"$f":"IF(OR(E33=\"\",$F$29=0),\"\",IF(F33>100,(1-1/(9*F33)-$B$38/(3*SQRT(F33)))^3*F33/G33,IF(F33>0,CHIINV($B$37,2*F33)/2/G33,0)))","v":""},null,{"$f":"IF(OR(E33=\"\",$F$29=0),\"\",IF(F33>100,(1-1/(9*(F33+1))+$B$38/(3*SQRT(F33+1)))^3*(F33+1)/G33,IF(F33>0,CHIINV($B$36,2*(F33+1))/2/G33,CHIINV($B$36,2)/2/G33)))","v":""},null,4,{"$f":"IF(OR(E33=\"\",$F$29=0),\"\",RANK(H33,$H$30:$H$33,0))","v":""},{"$f":"IF(E33=\"\",\"\",Id!E44)","v":"A404"},"ULS Litoral Alentejano","",""]
[]
[2,{"$f":"VLOOKUP(A35,E35:I37,2,FALSE)","v":0.95},null,"Intervalos de Confiança",1,0.9,0.05,0.95,{"$f":"NORMSINV(H35)","v":1.6448536269514715}]
[null,{"$f":"VLOOKUP(A35,E35:I37,3,FALSE)","v":2.5000000000000001E-2},null,{"$f":"\"I.C. (\" & B35*100 & \"%)\"","v":"I.C. (95%)"},2,0.95,2.5000000000000001E-2,0.97499999999999998,{"$f":"NORMSINV(H36)","v":1.9599639845400536}]
[null,{"$f":"VLOOKUP(A35,E35:I37,4,FALSE)","v":0.97499999999999998},null,null,3,0.98,0.01,0.99,{"$f":"NORMSINV(H37)","v":2.3263478740408408}]
[null,{"$f":"VLOOKUP(A35,E35:I37,5,FALSE)","v":1.9599639845400536}]
[]
[null,null,null,null,"Map","O","E","R","IC_min","Ic_max"]
[{"$f":"IF(OR(E30=\"\",$F$29=0),\"\",VLOOKUP(M30,$N$30:$Q$33,2,FALSE))","v":""},{"$f":"IF(OR(E30=\"\",$F$29=0),\"\",VLOOKUP(M30,$N$30:$Q$33,3,FALSE))","v":""},{"$f":"IF(OR(E30=\"\",$F$29=0),\"\",VLOOKUP(M30,$N$30:$Q$33,4,FALSE))","v":""},{"$f":"IF($E$21=\"\",\"\",IF(C41=$E$21,E41,\"\"))","v":""},{"$f":"IF(OR(E30=\"\",$F$29=0),\"\",VLOOKUP(M30,$N$30:$R$33,5,FALSE))","v":""},{"$f":"IF($A41=\"\",\"\",VLOOKUP($C41,$E$30:$K$33,2,FALSE))","v":""},{"$f":"IF($A41=\"\",\"\",VLOOKUP($C41,$E$30:$K$33,3,FALSE))","v":""},{"$f":"IF($A41=\"\",\"\",VLOOKUP($C41,$E$30:$K$33,4,FALSE)*100)","v":""},{"$f":"IF($A41=\"\",\"\",VLOOKUP($C41,$E$30:$K$33,5,FALSE)*100)","v":""},{"$f":"IF($A41=\"\",\"\",VLOOKUP($C41,$E$30:$K$33,6,FALSE)*100)","v":""},{"$f":"IF(A41=\"\",\"\",CONCATENATE(\"(\",FIXED(I41,1),\" - \",FIXED(J41,1),\")\"))","v":""},{"$f":"IF(A41=\"\",\"\",CONCATENATE(B41,\" (\",A41,\")\"))","v":""}]
[{"$f":"IF(OR(E31=\"\",$F$29=0),\"\",VLOOKUP(M31,$N$30:$Q$33,2,FALSE))","v":""},{"$f":"IF(OR(E31=\"\",$F$29=0),\"\",VLOOKUP(M31,$N$30:$Q$33,3,FALSE))","v":""},{"$f":"IF(OR(E31=\"\",$F$29=0),\"\",VLOOKUP(M31,$N$30:$Q$33,4,FALSE))","v":""},{"$f":"IF($E$21=\"\",\"\",IF(C42=$E$21,E42,\"\"))","v":""},{"$f":"IF(OR(E31=\"\",$F$29=0),\"\",VLOOKUP(M31,$N$30:$R$33,5,FALSE))","v":""},{"$f":"IF($A42=\"\",\"\",VLOOKUP($C42,$E$30:$K$33,2,FALSE))","v":""},{"$f":"IF($A42=\"\",\"\",VLOOKUP($C42,$E$30:$K$33,3,FALSE))","v":""},{"$f":"IF($A42=\"\",\"\",VLOOKUP($C42,$E$30:$K$33,4,FALSE)*100)","v":""},{"$f":"IF($A42=\"\",\"\",VLOOKUP($C42,$E$30:$K$33,5,FALSE)*100)","v":""},{"$f":"IF($A42=\"\",\"\",VLOOKUP($C42,$E$30:$K$33,6,FALSE)*100)","v":""},{"$f":"IF(A42=\"\",\"\",CONCATENATE(\"(\",FIXED(I42,1),\" - \",FIXED(J42,1),\")\"))","v":""},{"$f":"IF(A42=\"\",\"\",CONCATENATE(B42,\" (\",A42,\")\"))","v":""}]
[{"$f":"IF(OR(E32=\"\",$F$29=0),\"\",VLOOKUP(M32,$N$30:$Q$33,2,FALSE))","v":""},{"$f":"IF(OR(E32=\"\",$F$29=0),\"\",VLOOKUP(M32,$N$30:$Q$33,3,FALSE))","v":""},{"$f":"IF(OR(E32=\"\",$F$29=0),\"\",VLOOKUP(M32,$N$30:$Q$33,4,FALSE))","v":""},"",{"$f":"IF(OR(E32=\"\",$F$29=0),\"\",VLOOKUP(M32,$N$30:$R$33,5,FALSE))","v":""},{"$f":"IF($A43=\"\",\"\",VLOOKUP($C43,$E$30:$K$33,2,FALSE))","v":""},{"$f":"IF($A43=\"\",\"\",VLOOKUP($C43,$E$30:$K$33,3,FALSE))","v":""},{"$f":"IF($A43=\"\",\"\",VLOOKUP($C43,$E$30:$K$33,4,FALSE)*100)","v":""},{"$f":"IF($A43=\"\",\"\",VLOOKUP($C43,$E$30:$K$33,5,FALSE)*100)","v":""},{"$f":"IF($A43=\"\",\"\",VLOOKUP($C43,$E$30:$K$33,6,FALSE)*100)","v":""},{"$f":"IF(A43=\"\",\"\",CONCATENATE(\"(\",FIXED(I43,1),\" - \",FIXED(J43,1),\")\"))","v":""},{"$f":"IF(A43=\"\",\"\",CONCATENATE(B43,\" (\",A43,\")\"))","v":""}]
[{"$f":"IF(OR(E33=\"\",$F$29=0),\"\",VLOOKUP(M33,$N$30:$Q$33,2,FALSE))","v":""},{"$f":"IF(OR(E33=\"\",$F$29=0),\"\",VLOOKUP(M33,$N$30:$Q$33,3,FALSE))","v":""},{"$f":"IF(OR(E33=\"\",$F$29=0),\"\",VLOOKUP(M33,$N$30:$Q$33,4,FALSE))","v":""},"",{"$f":"IF(OR(E33=\"\",$F$29=0),\"\",VLOOKUP(M33,$N$30:$R$33,5,FALSE))","v":""},{"$f":"IF($A44=\"\",\"\",VLOOKUP($C44,$E$30:$K$33,2,FALSE))","v":""},{"$f":"IF($A44=\"\",\"\",VLOOKUP($C44,$E$30:$K$33,3,FALSE))","v":""},{"$f":"IF($A44=\"\",\"\",VLOOKUP($C44,$E$30:$K$33,4,FALSE)*100)","v":""},{"$f":"IF($A44=\"\",\"\",VLOOKUP($C44,$E$30:$K$33,5,FALSE)*100)","v":""},{"$f":"IF($A44=\"\",\"\",VLOOKUP($C44,$E$30:$K$33,6,FALSE)*100)","v":""},{"$f":"IF(A44=\"\",\"\",CONCATENATE(\"(\",FIXED(I44,1),\" - \",FIXED(J44,1),\")\"))","v":""},{"$f":"IF(A44=\"\",\"\",CONCATENATE(B44,\" (\",A44,\")\"))","v":""}]
[]
["Mapear"]
[null,null,"ACeS"]
[null,null,"A401",{"$f":"IF(R30=\"\",\"\",R30)","v":""},null,null,0,"classeR0"]
[null,null,"A402",{"$f":"IF(R31=\"\",\"\",R31)","v":""},null,null,2,"classeR1"]
[null,null,"A403",{"$f":"IF(R32=\"\",\"\",R32)","v":""},null,null,1,"classeR2"]
[null,null,"A404",{"$f":"IF(R33=\"\",\"\",R33)","v":""},null,null,-1,"classeR3"]
[null,null,null,null,null,null,-2,"classeR4"]
[]
[null,null,null,null,null,"ACeS Activo","A402","ACeSActR"]
[null,null,null,null,null,"Valor",{"$f":"IF(D48=\"\",0,VLOOKUP(ACeSActR,DadosMapearR,2,FALSE))","v":0},"ACeSActValorR"]
[null,null,null,null,null,"Código",{"$f":"VLOOKUP(ACeSActValorR,classeValoresR,2,FALSE)","v":"classeR0"},"ACeSActCodR"]
[]
[]
[]
[]
[]
[]
[]
[]
[]
[]
[]
[]
[]
[null,"AnR_ACeS_Select",{"$f":"IF(AnR_CodACeS=\"\",\"\",VLOOKUP(AnR_CodACeS,Id!$D$39:$G$44,4,FALSE))","v":"A402"}]
[]
[null,"Legenda"]
[null,{"$f":"IF(AnR_IndSelect=1,\"\",D2 & \", QUINQUÉNIO \" & C23)","v":"NASCIMENTOS PRÉ-TERMO, QUINQUÉNIO 1996-2000"}]
[null,{"$f":"IF(AnR_IndSelect=1,\"\",\"Comparação com \" & D25 & \", \" & D36)","v":"Comparação com Região Alentejo, I.C. (95%)"}]
[null,{"$f":"IF(AnR_IndSelect=1,\"\",\"Comparação com \" & D25 & \", R=100\")","v":"Comparação com Região Alentejo, R=100"}]